Tetraethyl sulphamide
- Formula: C8H20N2O2S
- Molecular weight: 208.322
- IUPAC Standard InChIKey: IYIAWAACGTUPCC-UHFFFAOYSA-N
- CAS Registry Number: 2832-49-7
- Chemical structure:
View 3d structure (requires JavaScript / HTML 5) - Other names: N,N,N',N'-Tetraethylsulfamide

Condensed phase thermochemistry data

Data compiled by: Hussein Y. Afeefy, Joel F. Liebman, and Stephen E. Stein
Quantity | Value | Units | Method | Reference | Comment |
---|---|---|---|---|---|
ΔfH°liquid | -635.5 ± 9.9 | kJ/mol | Cm | Claydon and Mortimer, 1962 | Reanalyzed by Cox and Pilcher, 1970, Original value = -626.8 ± 9.6 kJ/mol |

Phase change data

Data compiled by: William E. Acree, Jr., James S. Chickos
Enthalpy of vaporization
ΔvapH (kJ/mol) | Temperature (K) | Method | Reference | Comment |
---|---|---|---|---|
59.1 | 422. | A | Stephenson and Malanowski, 1987 | Based on data from 407. to 528. K. |

Reaction thermochemistry data

Data compiled by: Hussein Y. Afeefy, Joel F. Liebman, and Stephen E. Stein
Individual Reactions
By formula: C8H20N2O2S + 2C4H12ClN = 4C4H11N + Cl2O2S
Quantity | Value | Units | Method | Reference | Comment |
---|---|---|---|---|---|
ΔrH° | 543.9 ± 7.1 | kJ/mol | Cm | Claydon and Mortimer, 1962 | liquid phase; Reanalyzed by Cox and Pilcher, 1970, Original value = 543.1 ± 7.1 kJ/mol |

References

Claydon and Mortimer, 1962
Claydon, A.P.; Mortimer, C.T.,
Heats of formation and bond energies. Part VIII. Diethylaminotrimethylsilane, NN'-dithiodiethylamine, NN'-thionylbisdiethylamine, and NN'-sulphurylbisdiethylamine,
J. Chem. Soc., 1962, 3212-3216. [all data]
Cox and Pilcher, 1970
Cox, J.D.; Pilcher, G.,
Thermochemistry of Organic and Organometallic Compounds, Academic Press, New York, 1970, 1-636. [all data]
Stephenson and Malanowski, 1987
Stephenson, Richard M.; Malanowski, Stanislaw,
Handbook of the Thermodynamics of Organic Compounds, 1987, https://doi.org/10.1007/978-94-009-3173-2
. [all data]