trans-5-Ethylidene-bicyclo[2.2.1]hept-2-ene
- Formula: C9H12
- Molecular weight: 120.1916
- IUPAC Standard InChIKey: OJOWICOBYCXEKR-KRXBUXKQSA-N
- CAS Registry Number: 28304-67-8
- Chemical structure:
View 3d structure (requires JavaScript / HTML 5) - Species with the same structure:
- Stereoisomers:

Gas phase thermochemistry data

Data compiled by: Hussein Y. Afeefy, Joel F. Liebman, and Stephen E. Stein
Quantity | Value | Units | Method | Reference | Comment |
---|---|---|---|---|---|
ΔfH°gas | 150.4 ± 2.0 | kJ/mol | Ccb | Kozina, Timofeeva, et al., 1972 |

Condensed phase thermochemistry data

Data compiled by: Hussein Y. Afeefy, Joel F. Liebman, and Stephen E. Stein
Quantity | Value | Units | Method | Reference | Comment |
---|---|---|---|---|---|
ΔfH°liquid | 106.5 ± 1.8 | kJ/mol | Ccb | Kozina, Timofeeva, et al., 1972 | |
Quantity | Value | Units | Method | Reference | Comment |
ΔcH°liquid | -5363.1 ± 1.8 | kJ/mol | Ccb | Kozina, Timofeeva, et al., 1972 | Corresponding ΔfHºliquid = 106.6 kJ/mol (simple calculation by NIST; no Washburn corrections) |

Phase change data

Data compiled as indicated in comments:
DRB - Donald R. Burgess, Jr.
AC - William E. Acree, Jr., James S. Chickos
Quantity | Value | Units | Method | Reference | Comment |
---|---|---|---|---|---|
ΔvapH° | 43.9 | kJ/mol | N/A | Kozina, Timofeeva, et al., 1972 | DRB |
Enthalpy of vaporization
ΔvapH (kJ/mol) | Temperature (K) | Method | Reference | Comment |
---|---|---|---|---|
41.2 | 361. | A | Stephenson and Malanowski, 1987 | Based on data from 346. to 416. K.; AC |

References

Kozina, Timofeeva, et al., 1972
Kozina, M.P.; Timofeeva, L.P.; Pimenova, S.M.; Aleshina, V.A.; Belikova, N.A.; Bobyleva, A.A.; Plate, A.F.,
Enthalpies of combustion and of formation of 4-vinylcyclohexene and of certain bicyclic compounds,
Russ. J. Phys. Chem. (Engl. Transl.), 1972, 46, 1689-1690. [all data]
Stephenson and Malanowski, 1987
Stephenson, Richard M.; Malanowski, Stanislaw,
Handbook of the Thermodynamics of Organic Compounds, 1987, https://doi.org/10.1007/978-94-009-3173-2
. [all data]