3-Aminoheptane
- Formula: C7H17N
- Molecular weight: 115.2166
- IUPAC Standard InChIKey: SRMHHEPXZLWKOK-UHFFFAOYSA-N
- CAS Registry Number: 28292-42-4
- Chemical structure:
View 3d structure (requires JavaScript / HTML 5) - Other names: 3-Heptanamine; 3-Heptylamine; 1-ethylpentylamine

Phase change data

Data compiled by: Thermodynamics Research Center, NIST Boulder Laboratories, Chris Muzny director
Quantity | Value | Units | Method | Reference | Comment |
---|---|---|---|---|---|
Tboil | 414.15 | K | N/A | Iffland and Yen, 1954 | Uncertainty assigned by TRC = 3. K |

Van Den Dool and Kratz RI, non-polar column, custom temperature program

View large format table.

Column type Active phase I Reference Comment
CapillaryMethyl Silicone868.Peng, Yang, et al., 1991Program: not specified

Normal alkane RI, polar column, custom temperature program

View large format table.

Column type Active phase I Reference Comment
CapillaryDB-Wax1137.Peng, Yang, et al., 1991, 2Program: not specified

References

Iffland and Yen, 1954
Iffland, D.C.; Yen, T.-F.,
Preparation of Amines by Low Pressure Hydrogenation of Oximes,
J. Am. Chem. Soc., 1954, 76, 4180. [all data]