3,4-Methylenedioxypropiophenone
- Formula: C10H10O3
- Molecular weight: 178.1846
- IUPAC Standard InChIKey: RVBJGSPBFIUTTR-UHFFFAOYSA-N
- CAS Registry Number: 28281-49-4
- Chemical structure:
View 3d structure (requires JavaScript / HTML 5) - Other names: 1-Propanone, 1-(1,3-benzodioxol-5-yl)-; 1-(1,3-Benzodioxol-5-yl)-1-propanone; 3',4'-Methylenedioxypropiophenone; NSC 29484; 1-(1,3-benzodioxol-5-yl)propan-1-one

Phase change data

Data compiled by: Robert L. Brown and Stephen E. Stein
Reduced pressure boiling point
Tboil (K) | Pressure (bar) | Reference |
---|---|---|
438. to 441. | 0.027 | Frinton Laboratories Inc., 1986 |

References

Frinton Laboratories Inc., 1986
Frinton Laboratories Inc.,
Catalog Number 11, Frinton Laboratories Inc., Vineland, NJ, 1986, 99. [all data]