endo-Ttricyclo[5.2.1.0(2,6)]decane
- Formula: C10H16
- Molecular weight: 136.2340
- IUPAC Standard InChIKey: HFDBLHGEKMWGRC-KPWCQOOUSA-N
- CAS Registry Number: 2825-83-4
- Chemical structure:
View 3d structure (requires JavaScript / HTML 5) - Stereoisomers:
- Other names: 4,7-Methano-1H-indene, octahydro-, (3aα,4α,7α,7aα)-; (3aα,4α,7α,7aα)-octahydro-4,7-methano-1H-indene; endo tetrahydrodicyclopentadiene

Phase change data

Data compiled by: William E. Acree, Jr., James S. Chickos
Enthalpy of fusion
ΔfusH (kJ/mol) | Temperature (K) | Method | Reference |
---|---|---|---|
3.48 | 356.8 | DSC | Chickos, Hillesheim, et al., 2002 |

Reaction thermochemistry data

Data compiled by: Hussein Y. Afeefy, Joel F. Liebman, and Stephen E. Stein
Individual Reactions
By formula: 2H2 + C10H12 = C10H16
Quantity | Value | Units | Method | Reference | Comment |
---|---|---|---|---|---|
ΔrH° | -363. ± 1. | kJ/mol | Chyd | Roth, Klarner, et al., 1980 | liquid phase; solvent: Cyclohexane |

References

Chickos, Hillesheim, et al., 2002
Chickos, James S.; Hillesheim, Dorothea; Nichols, Gary; Zehe, Michael J.,
The enthalpies of vaporization and sublimation of exo- and endo-tetrahydrodicyclopentadienes at T=298.15K,
The Journal of Chemical Thermodynamics, 2002, 34, 10, 1647-1658, https://doi.org/10.1016/S0021-9614(02)00229-X
. [all data]
Roth, Klarner, et al., 1980
Roth, W.R.; Klarner, F.-G.; Lennartz, H.-W.,
Heats of hydrogenation. II. Heat of hydrogenation of bicyclo[2.1.0]pent-2-ene, an antiaromatic system,
Chem. Ber., 1980, 113, 1806-1818. [all data]