cis-2-octadecenoic acid
- Formula: C18H34O2
- Molecular weight: 282.4614
- CAS Registry Number: 2825-66-3

Phase change data

Data compiled by: Thermodynamics Research Center, NIST Boulder Laboratories, Chris Muzny director
Quantity | Value | Units | Method | Reference | Comment |
---|---|---|---|---|---|
Tfus | 323.9 | K | N/A | Myers, 1951 | Uncertainty assigned by TRC = 1. K |

References

Myers, 1951
Myers, G.S.,
2-Octadecenoic Acid I> Preparation and SOme Reactions of the cis and trans Isomers,
J. Am. Chem. Soc., 1951, 73, 2100-4. [all data]