1H-Pyrazole, 3,4-dimethyl-
- Formula: C5H8N2
- Molecular weight: 96.1304
- IUPAC Standard InChIKey: VQTVFIMEENGCJA-UHFFFAOYSA-N
- CAS Registry Number: 2820-37-3
- Chemical structure:

Phase change data

Data compiled by: Thermodynamics Research Center, NIST Boulder Laboratories, Chris Muzny director
Quantity | Value | Units | Method | Reference | Comment |
---|---|---|---|---|---|
Tfus | 331.15 | K | N/A | Von Auwers and Kohlhaas, 1924 | Uncertainty assigned by TRC = 1.5 K |

Reaction thermochemistry data

Data compiled by: John E. Bartmess
Individual Reactions
C5H7N2- + =
By formula: C5H7N2- + H+ = C5H8N2
Quantity | Value | Units | Method | Reference | Comment |
---|---|---|---|---|---|
ΔrH° | 355.7 ± 2.1 | kcal/mol | G+TS | Taft, 1991 | gas phase |
Quantity | Value | Units | Method | Reference | Comment |
ΔrG° | 348.0 ± 2.0 | kcal/mol | IMRE | Taft, 1991 | gas phase |

Gas phase ion energetics data

Data evaluated as indicated in comments:
HL - Edward P. Hunter and Sharon G. Lias
Data compiled as indicated in comments:
B - John E. Bartmess
Quantity | Value | Units | Method | Reference | Comment |
---|---|---|---|---|---|
Proton affinity (review) | 221.6 | kcal/mol | N/A | Hunter and Lias, 1998 | HL |
Quantity | Value | Units | Method | Reference | Comment |
Gas basicity | 214.0 | kcal/mol | N/A | Hunter and Lias, 1998 | HL |
De-protonation reactions
C5H7N2- + =
By formula: C5H7N2- + H+ = C5H8N2
Quantity | Value | Units | Method | Reference | Comment |
---|---|---|---|---|---|
ΔrH° | 355.7 ± 2.1 | kcal/mol | G+TS | Taft, 1991 | gas phase; B |
Quantity | Value | Units | Method | Reference | Comment |
ΔrG° | 348.0 ± 2.0 | kcal/mol | IMRE | Taft, 1991 | gas phase; B |

References

Von Auwers and Kohlhaas, 1924
Von Auwers, K.; Kohlhaas, W.,
The Spectrochemistry of Heterocylic Nitrogen Compounds,
Justus Liebigs Ann. Chem., 1924, 437, 36. [all data]
Taft, 1991
Taft, R.W.,
, personal communication, Aug, 1991. [all data]
Hunter and Lias, 1998
Hunter, E.P.; Lias, S.G.,
Evaluated Gas Phase Basicities and Proton Affinities of Molecules: An Update,
J. Phys. Chem. Ref. Data, 1998, 27, 3, 413-656, https://doi.org/10.1063/1.556018
. [all data]