1H-Pyrazole, 1-ethyl-

Kovats' RI, non-polar column, isothermal

Data compiled by: NIST Mass Spectrometry Data Center, William E. Wallace, director

Column type Capillary
Active phase OV-101
Column length (m)
Carrier gas He
Substrate
Column diameter (mm)
Phase thickness (μm) 0.4
Temperature (C) 110.
I 809.
ReferenceGolovnya, Kuz'menko, et al., 2000
Comment MSDC-RI

References

Golovnya, Kuz'menko, et al., 2000
Golovnya, R.V.; Kuz'menko, T.E.; Krikunova, N.I., The influence of alkyl substituents on the chromatographic indicator of self-association of N-containing heterocyclic compounds, Russ. Chem. Bull. (Engl. Transl.), 2000, 49, 2, 321-324, https://doi.org/10.1007/BF02494681 . [all data]