N,N-Dimethyl-N'-m-methylphenylurea
- Formula: C10H14N2O
- Molecular weight: 178.2310
- IUPAC Standard InChIKey: JUMFQCKSVYYQJC-UHFFFAOYSA-N
- CAS Registry Number: 28170-41-4
- Chemical structure:
View 3d structure (requires JavaScript / HTML 5) - Permanent link for this species. Use this link for bookmarking this species for future reference.

Reaction thermochemistry data

Data compiled by: Hussein Y. Afeefy, Joel F. Liebman, and Stephen E. Stein
Individual Reactions
By formula: C10H14N2O = C2H7N + C8H7NO
Quantity | Value | Units | Method | Reference | Comment |
---|---|---|---|---|---|
ΔrH° | 109.9 | kJ/mol | Eqk | Chimishkyan, Svetlova, et al., 1984 | solid phase; Dissociation |

References

Chimishkyan, Svetlova, et al., 1984
Chimishkyan, A.L.; Svetlova, L.P.; Leonova, T.V.; Gluyaev, N.D.,
Thermal decomposition of substituted ureas,
J. Gen. Chem. USSR, 1984, 54, 1317-1320. [all data]