Cyclohexanone, 2,6-dimethyl-
- Formula: C8H14O
- Molecular weight: 126.1962
- IUPAC Standard InChIKey: AILVYPLQKCQNJC-UHFFFAOYSA-N
- CAS Registry Number: 2816-57-1
- Chemical structure:
View 3d structure (requires JavaScript / HTML 5) - Other names: 2,6-Dimethylcyclohexanone; 2,6-Dimethylcyclohexanone,c&t; 2,6-Dimethylcyclohexanone cis + trans; 2,6-dimethylcyclohexan-1-one

Condensed phase thermochemistry data

Data compiled by: Hussein Y. Afeefy, Joel F. Liebman, and Stephen E. Stein
Quantity | Value | Units | Method | Reference | Comment |
---|---|---|---|---|---|
ΔcH°liquid | -4765.6 | kJ/mol | Ccb | Zubova, 1901 | Corresponding ΔfHºliquid = -383. kJ/mol (simple calculation by NIST; no Washburn corrections) |

Phase change data

Data compiled by: Robert L. Brown and Stephen E. Stein
Quantity | Value | Units | Method | Reference | Comment |
---|---|---|---|---|---|
Tboil | 448.2 | K | N/A | Weast and Grasselli, 1989 |

Van Den Dool and Kratz RI, non-polar column, temperature ramp

Column type | Active phase | I | Reference | Comment |
---|---|---|---|---|
Capillary | DB-5 | 994. | Javidnia, Miri, et al., 2002 | He, 4. K/min; Column length: 25. m; Column diameter: 0.25 mm; Tstart: 70. C; Tend: 275. C |

Normal alkane RI, non-polar column, custom temperature program

Column type | Active phase | I | Reference | Comment |
---|---|---|---|---|
Capillary | SE-30 | 985. | Vinogradov, 2004 | Program: not specified |

Normal alkane RI, polar column, custom temperature program

Column type | Active phase | I | Reference | Comment |
---|---|---|---|---|
Capillary | Carbowax 20M | 1322. | Vinogradov, 2004 | Program: not specified |

References

Zubova, 1901
Zubova, P.,
Data about heat of combustion of compound cycle structure,
Zh. Fiz. Khim., 1901, 33, 708-722. [all data]
Weast and Grasselli, 1989
CRC Handbook of Data on Organic Compounds, 2nd Editon, Weast,R.C and Grasselli, J.G., ed(s)., CRC Press, Inc., Boca Raton, FL, 1989, 1. [all data]
Javidnia, Miri, et al., 2002
Javidnia, K.; Miri, R.; Safavi, F.; Azarpira, A.; Shafiee, A.,
Composition of the essential oil of Nepeta persica Boiss from Iran,
Flavour Fragr. J., 2002, 17, 1, 20-22, https://doi.org/10.1002/ffj.1023
. [all data]
Vinogradov, 2004
Vinogradov, B.A.,
Production, composition, properties and application of essential oils, 2004, retrieved from http://viness.narod.ru. [all data]