Digermane, hexaphenyl-
- Formula: C36H30Ge2
- Molecular weight: 607.90
- IUPAC Standard InChIKey: MZZSGDPNYJAKCA-UHFFFAOYSA-N
- CAS Registry Number: 2816-39-9
- Chemical structure:

Condensed phase thermochemistry data

Data compiled by: José A. Martinho Simões
Quantity | Value | Units | Method | Reference | Comment |
---|---|---|---|---|---|
ΔfH°solid | 446. ± 12. | kJ/mol | Review | Martinho Simões | |
Quantity | Value | Units | Method | Reference | Comment |
ΔcH°solid | -20010. ± 11. | kJ/mol | CC-RB | Carson, Carson, et al., 1970 | Please also see Pedley and Rylance, 1977. |

Phase change data

Data compiled as indicated in comments:
AC - William E. Acree, Jr., James S. Chickos
MS - José A. Martinho Simões
Quantity | Value | Units | Method | Reference | Comment |
---|---|---|---|---|---|
ΔsubH° | 209.2 ± 4.2 | kJ/mol | N/A | Pilcher and Skinner, 1983 | See also Carson, Carson, et al., 1970.; AC |
ΔsubH° | 209.2 ± 4.2 | kJ/mol | CC-RB | Kana'an, 1974 | MS |

Gas phase thermochemistry data

Data compiled by: José A. Martinho Simões
Quantity | Value | Units | Method | Reference | Comment |
---|---|---|---|---|---|
ΔfH°gas | 156.7 ± 3.0 | kcal/mol | Review | Martinho Simões |

References

Martinho Simões
Martinho Simões, J.A.,
Private communication (see http://webbook.nist.gov/chemistry/om/). [all data]
Carson, Carson, et al., 1970
Carson, A.S.; Carson, E.M.; Laye, P.G.; Spencer, J.A.; Steele, W.V.,
Enthalpy of combustion of organo-metallic compounds measured with a vacuum-jacketed, rotating, aneroid calorimeter. The enthalpies of formation of germanium tetrabenzyl and di-germanium hexaphenyl,
Trans. Faraday Soc., 1970, 66, 2459, https://doi.org/10.1039/tf9706602459
. [all data]
Pedley and Rylance, 1977
Pedley, J.B.; Rylance, J.,
Computer Analysed Thermochemical Data: Organic and Organometallic Compounds, University of Sussex, Brigton, 1977. [all data]
Pilcher and Skinner, 1983
Pilcher, G.; Skinner, H.A.,
Thermochemistry of organometallic compounds, 1983, 43-90, https://doi.org/10.1002/9780470771686.ch2
. [all data]
Kana'an, 1974
Kana'an, A.S.,
J. Chem. Thermodyn., 1974, 6, 191. [all data]