Propane, 1,3-dibromo-2-methyl-
- Formula: C4H8Br2
- Molecular weight: 215.914
- IUPAC Standard InChIKey: SMGXHVWYXQYMNN-UHFFFAOYSA-N
- CAS Registry Number: 28148-04-1
- Chemical structure:
View 3d structure (requires JavaScript / HTML 5) - Other names: 1,3-Dibromoisobutane

Condensed phase thermochemistry data

Data compiled by: Hussein Y. Afeefy, Joel F. Liebman, and Stephen E. Stein
Quantity | Value | Units | Method | Reference | Comment |
---|---|---|---|---|---|
ΔfH°liquid | -141.8 | kJ/mol | Eqk | Rozhnov, Nesterova, et al., 1975 | Gas phase isomerization |

Phase change data

Data compiled by: William E. Acree, Jr., James S. Chickos
Enthalpy of vaporization
ΔvapH (kJ/mol) | Temperature (K) | Method | Reference | Comment |
---|---|---|---|---|
45.1 | 302. | A | Stephenson and Malanowski, 1987 | Based on data from 287. to 448. K. See also Stull, 1947. |

Reaction thermochemistry data

Data compiled by: Hussein Y. Afeefy, Joel F. Liebman, and Stephen E. Stein
Individual Reactions
By formula: C4H8Br2 = C4H8Br2
Quantity | Value | Units | Method | Reference | Comment |
---|---|---|---|---|---|
ΔrH° | -8.8 ± 0.3 | kJ/mol | Eqk | Rozhnov, Nesterova, et al., 1975 | liquid phase; Gas phase isomerization |

Normal alkane RI, non-polar column, custom temperature program

Column type | Active phase | I | Reference | Comment |
---|---|---|---|---|
Capillary | Methyl Silicone | 903. | Zenkevich and Marinichev, 2001 | Program: not specified |

References

Rozhnov, Nesterova, et al., 1975
Rozhnov, A.M.; Nesterova, T.N.; Mukovnina, G.S.,
Equilibrium in the isomerisation of dibromoalkanes. II. Isomerisation of dibromoisobutanes,
Russ. J. Phys. Chem. (Engl. Transl.), 1975, 49, 1675-1676. [all data]
Stephenson and Malanowski, 1987
Stephenson, Richard M.; Malanowski, Stanislaw,
Handbook of the Thermodynamics of Organic Compounds, 1987, https://doi.org/10.1007/978-94-009-3173-2
. [all data]
Stull, 1947
Stull, Daniel R.,
Vapor Pressure of Pure Substances. Organic and Inorganic Compounds,
Ind. Eng. Chem., 1947, 39, 4, 517-540, https://doi.org/10.1021/ie50448a022
. [all data]
Zenkevich and Marinichev, 2001
Zenkevich, I.G.; Marinichev, A.N.,
Comparison of Topological and Dynamics Molecular Characteristics for Precalculation of Chromatographic Retention Parameters of Organic Compounds (in Russian),
Zh. Struct. Khim., 2001, 42, 5, 893-902. [all data]