Benzene, 2,4-dimethyl-1-(phenylmethyl)-

Phase change data

Data compiled by: Thermodynamics Research Center, NIST Boulder Laboratories, Chris Muzny director

Quantity Value Units Method Reference Comment
Tboil569.KN/AZincke, 1876Uncertainty assigned by TRC = 5. K; thermometer completely in vapor
Tboil556.KN/AZincke, 1876Uncertainty assigned by TRC = 10. K; thermometer bulb, only, in vapor
Tboil569.KN/AZincke, 1872Uncertainty assigned by TRC = 5. K

In addition to the Thermodynamics Research Center (TRC) data available from this site, much more physical and chemical property data is available from the following TRC products:

Lee's RI, non-polar column, custom temperature program

View large format table.

Column type Active phase I Reference Comment
CapillarySE-54278.5Peterman and Delfino, 199015. m/0.25 mm/0.25 μm, He; Program: 125 0C (15 min) 1 0C/min -> 131 0C 4 0C/min -> 247 0C 8 0C/min -> 280 0C (15 min)

References

Zincke, 1876
Zincke, T., Chem. Ber., 1876, 9, 1761. [all data]

Zincke, 1872
Zincke, T., Chem. ber., 1872, 5, 799. [all data]

Peterman and Delfino, 1990
Peterman, P.H.; Delfino, J.J., Identification of isopropylbiphenyl, alkyl diphenylmethanes, diisopropylnaphthalene, linear alkyl benzenes and other polychlorinated biphenyl replacement compounds in effluents, sediments and fish in the Fox River system, Wisconsin, Biomed. Environ. Mass Spectrom., 1990, 19, 12, 755-770, https://doi.org/10.1002/bms.1200191203 . [all data]