Cyclohexene, 1,5-dimethyl-
- Formula: C8H14
- Molecular weight: 110.1968
- IUPAC Standard InChIKey: QOSLKKIVSIPIFE-UHFFFAOYSA-N
- CAS Registry Number: 2808-77-7
- Chemical structure:
View 3d structure (requires JavaScript / HTML 5) - Other names: 1,5-dimethylcyclohexene

Phase change data

Data compiled by: Thermodynamics Research Center, NIST Boulder Laboratories, Chris Muzny director
Quantity | Value | Units | Method | Reference | Comment |
---|---|---|---|---|---|
Tboil | 402. | K | N/A | Mousseron and Granger, 1938 | Uncertainty assigned by TRC = 4. K; identification of isomer uncertain |
Tboil | 400.8 | K | N/A | Signaigo and Cramer, 1933 | Uncertainty assigned by TRC = 2. K |
Tboil | 398. | K | N/A | Von Auwers, Hinterseber, et al., 1915 | Uncertainty assigned by TRC = 4. K |

Normal alkane RI, non-polar column, custom temperature program

Column type | Active phase | I | Reference | Comment |
---|---|---|---|---|
Capillary | Squalane | 825. | Chen, 2008 | Program: not specified |
Capillary | Polydimethyl siloxanes | 829. | Zenkevich, Chupalov, et al., 1996 | Program: not specified |

References

Mousseron and Granger, 1938
Mousseron, M.; Granger, R.,
Bull. Soc. Chim. Belg., 1938, 1938, 5 1618. [all data]
Signaigo and Cramer, 1933
Signaigo, F.K.; Cramer, P.L.,
The preparation of some mono- and dialkylcylohexanes,
J. Am. Chem. Soc., 1933, 55, 3326-32. [all data]
Von Auwers, Hinterseber, et al., 1915
Von Auwers, K.; Hinterseber, R.; Treppman, W.,
Concerning Simple Hydroaromatic Hydrocarbons, Alcohols and Ketones,
Justus Liebigs Ann. Chem., 1915, 410, 257-287. [all data]
Chen, 2008
Chen, H.-F.,
Quantitative prediction of gas chromatography retention indices with support vector machines, radial basis neutral networks and multiple linear regression,
Anal. Chim. Acta, 2008, 609, 1, 24-36, https://doi.org/10.1016/j.aca.2008.01.003
. [all data]
Zenkevich, Chupalov, et al., 1996
Zenkevich, I.G.; Chupalov, A.A.; Herzschuh, R.,
Correlation of the Increments of Gas Chromatographic Retention Indices with the Differences of Innermolecular Energies of Reagents and Products of Chemical Reactions,
Zh. Org. Khim. (Rus.), 1996, 32, 11, 1685-1691. [all data]