1,3-Dimethyl-1-cyclohexene
- Formula: C8H14
- Molecular weight: 110.1968
- IUPAC Standard InChIKey: XTCMQAVNRXZBRH-UHFFFAOYSA-N
- CAS Registry Number: 2808-76-6
- Chemical structure:
View 3d structure (requires JavaScript / HTML 5) - Other names: 1,3-Dimethyl cyclohexene; Cyclohexene, 1,3-dimethyl-; 1,3-Dimethyl-3-cyclohexene

Kovats' RI, non-polar column, isothermal

Column type | Active phase | Temperature (C) | I | Reference | Comment |
---|---|---|---|---|---|
Capillary | SE-30 | 130. | 836. | Bredael, 1982 | Column length: 100. m; Column diameter: 0.5 mm |
Capillary | SE-30 | 80. | 825. | Bredael, 1982 | Column length: 100. m; Column diameter: 0.5 mm |

Normal alkane RI, non-polar column, custom temperature program

Column type | Active phase | I | Reference | Comment |
---|---|---|---|---|
Capillary | OV-1, SE-30, Methyl silicone, SP-2100, OV-101, DB-1, etc. | 825. | Waggott and Davies, 1984 | Hydrogen; Column length: 50. m; Column diameter: 0.32 mm; Program: not specified |

References

Bredael, 1982
Bredael, P.,
Retention indices of hydrocarbons on SE-30,
J. Hi. Res. Chromatogr. Chromatogr. Comm., 1982, 5, 6, 325-328, https://doi.org/10.1002/jhrc.1240050610
. [all data]
Waggott and Davies, 1984
Waggott, A.; Davies, I.W.,
Identification of organic pollutants using linear temperature programmed retention indices (LTPRIs) - Part II, 1984, retrieved from http://dwi.defra.gov.uk/research/completed-research/reports/dwi0383.pdf. [all data]