Benzenamine, 2-(phenylmethyl)-
- Formula: C13H13N
- Molecular weight: 183.2490
- IUPAC Standard InChIKey: DWOBGCPUQNFAFB-UHFFFAOYSA-N
- CAS Registry Number: 28059-64-5
- Chemical structure:
View 3d structure (requires JavaScript / HTML 5) - Other names: o-Aminodiphenylmethane; o-Benzylaniline; o-Toluidine, α-phenyl-; 2-Benzylaniline; 2-Aminodiphenylmethane

Phase change data

Data compiled by: Robert L. Brown and Stephen E. Stein
Quantity | Value | Units | Method | Reference | Comment |
---|---|---|---|---|---|
Tfus | 325. | K | N/A | Buckingham and Donaghy, 1982 |
Reduced pressure boiling point
Tboil (K) | Pressure (bar) | Reference |
---|---|---|
445.7 | 0.016 | Weast and Grasselli, 1989 |
463. | 0.029 | Buckingham and Donaghy, 1982 |
445. | 0.016 | Buckingham and Donaghy, 1982 |

References

Buckingham and Donaghy, 1982
Buckingham, J.; Donaghy, S.M.,
Dictionary of Organic Compounds: Fifth Edition, Chapman and Hall, New York, 1982, 1. [all data]
Weast and Grasselli, 1989
CRC Handbook of Data on Organic Compounds, 2nd Editon, Weast,R.C and Grasselli, J.G., ed(s)., CRC Press, Inc., Boca Raton, FL, 1989, 1. [all data]