Pentadecane, 4-methyl-
- Formula: C16H34
- Molecular weight: 226.4412
- IUPAC Standard InChIKey: ODDVOCXSLXTIIU-UHFFFAOYSA-N
- CAS Registry Number: 2801-87-8
- Chemical structure:
View 3d structure (requires JavaScript / HTML 5) - Other names: 4-Methylpentadecane

Phase change data

Data compiled as indicated in comments:
TRC - Thermodynamics Research Center, NIST Boulder Laboratories, Chris Muzny director
AC - William E. Acree, Jr., James S. Chickos
Quantity | Value | Units | Method | Reference | Comment |
---|---|---|---|---|---|
Tfus | 250. | K | N/A | Petrov, Sergienko, et al., 1959 | Uncertainty assigned by TRC = 2. K; TRC |
Enthalpy of vaporization
ΔvapH (kJ/mol) | Temperature (K) | Method | Reference | Comment |
---|---|---|---|---|
57.8 | 426. | A | Stephenson and Malanowski, 1987 | Based on data from 411. to 553. K.; AC |

Van Den Dool and Kratz RI, non-polar column, temperature ramp

Column type | Active phase | I | Reference | Comment |
---|---|---|---|---|
Capillary | Cross-Linked Methylsilicone | 1560. | Khorasheh, Gray, et al., 1989 | 5. K/min; Tstart: 40. C; Tend: 300. C |

Van Den Dool and Kratz RI, non-polar column, custom temperature program

Column type | Active phase | I | Reference | Comment |
---|---|---|---|---|
Capillary | DB-5 | 1557. | Zaikin and Borisov, 2002 | He; Column length: 30. m; Column diameter: 0.25 mm; Program: 30C => 5K/min=120C => 10C/min => 270C |

Van Den Dool and Kratz RI, polar column, custom temperature program

Column type | Active phase | I | Reference | Comment |
---|---|---|---|---|
Capillary | CP-Wax 52CB | 1555. | Romeo, Ziino, et al., 2007 | 60. m/0.25 mm/0.25 μm, He; Program: 45C(5min) => 10C/min => 80C => 2C/min => 240C |

Normal alkane RI, non-polar column, temperature ramp

Column type | Active phase | I | Reference | Comment |
---|---|---|---|---|
Capillary | OV-1 | 1560.0 | Krkosova, Kubinec, et al., 2007 | 100. m/0.32 mm/0.25 μm, Helium, 5. K/min, 310. C @ 5. min; Tstart: 30. C |

Normal alkane RI, non-polar column, custom temperature program

Column type | Active phase | I | Reference | Comment |
---|---|---|---|---|
Capillary | Squalane | 1554. | Petrov, 1984 | Program: not specified |
Capillary | Apiezon L | 1556. | Shlyakhov, 1984 | Program: not specified |

References

Petrov, Sergienko, et al., 1959
Petrov, A.A.; Sergienko, S.R.; Nechitailo, N.A.; Tsedilina, A.L.,
Izv. Akad. Nauk SSSR, 1959, 1959, 1091-7. [all data]
Stephenson and Malanowski, 1987
Stephenson, Richard M.; Malanowski, Stanislaw,
Handbook of the Thermodynamics of Organic Compounds, 1987, https://doi.org/10.1007/978-94-009-3173-2
. [all data]
Khorasheh, Gray, et al., 1989
Khorasheh, F.; Gray, M.R.; Selucky, M.L.,
Correlation for Kováts retention index of C9-C26 monoalkyl and polymethyl alkanes and alkenes,
J. Chromatogr., 1989, 481, 1-16, https://doi.org/10.1016/S0021-9673(01)96747-0
. [all data]
Zaikin and Borisov, 2002
Zaikin, V.G.; Borisov, R.S.,
Chromatographic-mass spectrometric analysis of Fishcer-Tropsch synthesis products,
J. Anal. Chem. USSR (Engl. Transl.), 2002, 57, 6, 544-551. [all data]
Romeo, Ziino, et al., 2007
Romeo, V.; Ziino, M.; Giuffrrida, D.; Condurso, C.; Verzera, A.,
Flavour profile of capers (Capparis spinosa L.) from the Eolian Archipelago by HS-SPME/GC?MS,
Food Chem., 2007, 101, 3, 1272-1278, https://doi.org/10.1016/j.foodchem.2005.12.029
. [all data]
Krkosova, Kubinec, et al., 2007
Krkosova, Z.; Kubinec, R.; Addova, G.; Jurdakova, H.; Blasko, J.; Ostrovsky, I.; Sojak, L.,
Gas chromatographic - mass spectrometric characterization of monomethylalkanes from fuel diesel,
Petroleum Coal, 2007, 49, 3, 51-62. [all data]
Petrov, 1984
Petrov, A.A.,
Hydrocarbons of petroleum, Nauka (publishing house), Moscow, 1984, 263. [all data]
Shlyakhov, 1984
Shlyakhov, A.F.,
Gas chromatography in organic geochemistry, Nedra, Moscow, 1984, 221. [all data]