2-Propanol, 1-amino-, (S)-
- Formula: C3H9NO
- Molecular weight: 75.1097
- IUPAC Standard InChIKey: HXKKHQJGJAFBHI-GSVOUGTGSA-N
- CAS Registry Number: 2799-17-9
- Chemical structure:
View 3d structure (requires JavaScript / HTML 5) - Stereoisomers:
- Other names: (S)-(+)-1-Amino-2-propanol; (S)-(+)-1-aminopropan-2-ol

Phase change data

Data compiled by: Robert L. Brown and Stephen E. Stein
Quantity | Value | Units | Method | Reference | Comment |
---|---|---|---|---|---|
Tboil | 433.2 | K | N/A | Aldrich Chemical Company Inc., 1990 |

References

Aldrich Chemical Company Inc., 1990
Aldrich Chemical Company Inc.,
Catalog Handbook of Fine Chemicals, Aldrich Chemical Company, Inc., Milwaukee WI, 1990, 1. [all data]