1,4-Naphthalenedione, 2-amino-3-chloro-
- Formula: C10H6ClNO2
- Molecular weight: 207.613
- IUPAC Standard InChIKey: OBLNWSCLAYSJJR-UHFFFAOYSA-N
- CAS Registry Number: 2797-51-5
- Chemical structure:
View 3d structure (requires JavaScript / HTML 5) - Other names: Quinoclamine; ACN; ACNQ; 2-Amino-3-chloronaphthoquinone; 2-Amino-3-chloro-1,4-naphthoquinone; 2-Chloro-3-amino-1,4-naphthoquinone; 3-Chloro-2-amino-1,4-naphthoquinone; Mogeton; 1,4-Naphthoquinone, 2-amino-3-chloro-; 06K-Quinone; O 6K-quinone; Mogeton G; Mogeton granule; 06K; 06K-50W; NSC 3910; NSC 642009; Quinoclamin

Kovats' RI, non-polar column, custom temperature program

Column type | Active phase | I | Reference | Comment |
---|---|---|---|---|
Capillary | HP-5 | 1961. | Tanabe, Mitobe, et al., 2000 | 30. m/0.32 mm/0.25 μm; Program: 50C(1min) => 20C/min => 150C => 10C/min => 280C(4min) |
Capillary | DB-5MS | 1974. | Tanabe, Mitobe, et al., 1996 | 30. m/0.32 mm/0.25 μm; Program: 50 C(1min)->20C/min->200C->10C/min->280C (1.5min) |

Normal alkane RI, non-polar column, custom temperature program

Column type | Active phase | I | Reference | Comment |
---|---|---|---|---|
Capillary | 5 % Phenyl methyl siloxane | 1968. | Department of Food Safety and Welfare, 2006 | 30. m/0.25 mm/0.25 μm, Helium; Program: 50 0C(1 min) 25 0C/min -> 125 0C 10 0C/min -> 300 0C (10 min) |
Capillary | HP-5 | 1961. | Kawara, Asada, et al., 2005 | 30. m/0.25 mm/0.25 μm; Program: 50 0C (1 min) 20 0C/min -> 150 0C 10 0C/min -> 280 0C |

References

(editor), 1976
(editor), Koptyug V.A.,
Atlas of Spectra of Aromatic and Heterocyclic Compounds, 1976, 10, 22. [all data]
Tanabe, Mitobe, et al., 2000
Tanabe, A.; Mitobe, H.; Kawata, K.; Sakai, M.; Yasuhara, A.,
New monitoring system for ninety pesticides and related compounds in river water by solid-phase extraction with determination by gas chromatography/mass spectrometry,
J. AOAC Int., 2000, 83, 1, 61-77. [all data]
Tanabe, Mitobe, et al., 1996
Tanabe, A.; Mitobe, H.; Kawata, K.; Sakai, M.,
Monitoring of herbicides in river water by gas chromatography-mass spectrometry and solid-phase extraction,
J. Chromatogr. A, 1996, 754, 1-2, 159-168, https://doi.org/10.1016/S0021-9673(96)00221-X
. [all data]
Department of Food Safety and Welfare, 2006
Department of Food Safety, Ministry of Health; Welfare,
Analytical methods for residual compositional substances of agricultural chemicals, feed aadditives, and veterinary drugs in foods, 2006, retrieved from http://www.mhlw.go.jp/english/topics/foodsafety/positivelist060228/de/060526-1a.pdf. [all data]
Kawara, Asada, et al., 2005
Kawara, K.; Asada, T.; Oikawa, K.; Tanabe, A.,
Multiresidue determination of pesticides in sediments by ultrasonically assisted extraction and gas chromatography/mass spectrometry,
J. AOAC International, 2005, 88, 5, 1440-1451. [all data]