Bicyclo[2.2.1]heptan-2-one, 1,7,7-trimethyl-, oxime, (1R)-
- Formula: C10H17NO
- Molecular weight: 167.2481
- IUPAC Standard InChIKey: OVFDEGGJFJECAT-MQPJBWICSA-N
- CAS Registry Number: 2792-42-9
- Chemical structure:
View 3d structure (requires JavaScript / HTML 5) - Stereoisomers:
- Other names: (+)-Camphor oxime; Camphor, oxime, (1R)-; D-Camphor oxime; 1,7,7-Trimethylbicyclo[2.2.1]heptan-2-one oxime; 1,7,7-Trimethylbicyclo[2.2.1]heptan-2-one oxime, (R)-; (1R)-1,7,7-trimethylbicyclo[2.2.1]heptan-2-one oxime

Condensed phase thermochemistry data

Data compiled by: Hussein Y. Afeefy, Joel F. Liebman, and Stephen E. Stein
Quantity | Value | Units | Method | Reference | Comment |
---|---|---|---|---|---|
ΔfH°solid | 44.4 | kJ/mol | Ccb | Landrieu, 1905 | |
Quantity | Value | Units | Method | Reference | Comment |
ΔcH°solid | -6196.9 | kJ/mol | Ccb | Landrieu, 1905 |

Phase change data

Data compiled as indicated in comments:
TRC - Thermodynamics Research Center, NIST Boulder Laboratories, Chris Muzny director
AC - William E. Acree, Jr., James S. Chickos
Quantity | Value | Units | Method | Reference | Comment |
---|---|---|---|---|---|
Tfus | 389. | K | N/A | Mjojo, 1979 | Crystal phase 1 phase; Uncertainty assigned by TRC = 1. K; TRC |
Quantity | Value | Units | Method | Reference | Comment |
Ttriple | 393.3 | K | N/A | Weinstein, Leffler, et al., 1984 | Crystal phase 1 phase; Uncertainty assigned by TRC = 1.5 K; TRC |
Enthalpy of fusion
ΔfusH (kJ/mol) | Temperature (K) | Method | Reference | Comment |
---|---|---|---|---|
2.1 | 393.3 | DSC | Weinstein, Leffler, et al., 1984, 2 | AC |
1.8 | 389. | DSC | Mjojo, 1979, 2 | AC |

References

Landrieu, 1905
Landrieu, Ph.,
Thermochimie. - Chaleur de formation des oximes,
C.R. Acad. Sc. Paris, 1905, 140, 867-870. [all data]
Mjojo, 1979
Mjojo, C.C.,
Order-disorder phenomena: part 2. order-disorder phase equilibria in d-and l-systems of camphor and related compounds.,
J. Chem. Soc., Faraday Trans. 2, 1979, 75, 692-703. [all data]
Weinstein, Leffler, et al., 1984
Weinstein, D.I.; Leffler, A.J.; Currie, J.A.,
Phase Transitions in Bicyclic Compounds,
Mol. Cryst. Liq. Cryst., 1984, 104, 95. [all data]
Weinstein, Leffler, et al., 1984, 2
Weinstein, D.I.; Leffler, A.J.; Currie, J.A.,
Phase Transitions In Bicyclic Compounds,
Molecular Crystals and Liquid Crystals, 1984, 104, 1-2, 95-109, https://doi.org/10.1080/00268948408070401
. [all data]
Mjojo, 1979, 2
Mjojo, Chodziwadziwa C.,
Order?disorder phenomena. Part 2.?Order?disorder phase equilibria in D- and L-systems of camphor and related compounds,
J. Chem. Soc., Faraday Trans. 2, 1979, 75, 692, https://doi.org/10.1039/f29797500692
. [all data]