Tricyclo-[3.2.0.0(2,7)]heptane
- Formula: C7H10
- Molecular weight: 94.1543
- IUPAC Standard InChIKey: YDOHPBBLOFQPQE-UHFFFAOYSA-N
- CAS Registry Number: 279-18-5
- Chemical structure:
View 3d structure (requires JavaScript / HTML 5) - Permanent link for this species. Use this link for bookmarking this species for future reference.

Gas phase thermochemistry data

Data compiled by: Hussein Y. Afeefy, Joel F. Liebman, and Stephen E. Stein
Quantity | Value | Units | Method | Reference | Comment |
---|---|---|---|---|---|
ΔfH°gas | 168. | kJ/mol | Chyd | Flury, Grob, et al., 1988 |

Reaction thermochemistry data

Data compiled by: Hussein Y. Afeefy, Joel F. Liebman, and Stephen E. Stein
Individual Reactions
By formula: H2 + C7H10 = C7H12
Quantity | Value | Units | Method | Reference | Comment |
---|---|---|---|---|---|
ΔrH° | -220. ± 0.8 | kJ/mol | Chyd | Flury, Grob, et al., 1988 | liquid phase; solvent: Isooctane |

References

Flury, Grob, et al., 1988
Flury, P.; Grob, C.A.; Wang, G.Y.; Lennatz, H.-W.; Roth, W.R.,
113. Norbornanes. Bridging strain in norbornyl and oxanorbornyl cations,
Helv. Chim. Acta, 1988, 71, 1017-1024. [all data]