methyl (S)-(-)-lactate
- Formula: C4H8O3
- Molecular weight: 104.1045
- IUPAC Standard InChIKey: LPEKGGXMPWTOCB-VKHMYHEASA-N
- CAS Registry Number: 27871-49-4
- Chemical structure:
View 3d structure (requires JavaScript / HTML 5) - Stereoisomers:
- Other names: Propanoic acid, 2-hydroxy-, methyl ester, (S)-

Phase change data

Data compiled as indicated in comments:
BS - Robert L. Brown and Stephen E. Stein
TRC - Thermodynamics Research Center, NIST Boulder Laboratories, Chris Muzny director
Quantity | Value | Units | Method | Reference | Comment |
---|---|---|---|---|---|
Tboil | 417.7 | K | N/A | Aldrich Chemical Company Inc., 1990 | BS |
Tboil | 417.0 | K | N/A | Lecat, 1947 | Uncertainty assigned by TRC = 0.8 K; TRC |
Reduced pressure boiling point
Tboil (K) | Pressure (bar) | Reference | Comment |
---|---|---|---|
331.2 | 0.025 | Weast and Grasselli, 1989 | BS |

References

Aldrich Chemical Company Inc., 1990
Aldrich Chemical Company Inc.,
Catalog Handbook of Fine Chemicals, Aldrich Chemical Company, Inc., Milwaukee WI, 1990, 1. [all data]
Lecat, 1947
Lecat, M.,
Orthobaric Azeotropes of Sulfides,
Bull. Cl. Sci., Acad. R. Belg., 1947, 33, 160-82. [all data]
Weast and Grasselli, 1989
CRC Handbook of Data on Organic Compounds, 2nd Editon, Weast,R.C and Grasselli, J.G., ed(s)., CRC Press, Inc., Boca Raton, FL, 1989, 1. [all data]