Phenol, 4-ethyl-2-methoxy-
- Formula: C9H12O2
- Molecular weight: 152.1904
- IUPAC Standard InChIKey: CHWNEIVBYREQRF-UHFFFAOYSA-N
- CAS Registry Number: 2785-89-9
- Chemical structure:
View 3d structure (requires JavaScript / HTML 5) - Other names: p-Ethylguaiacol; 2-Methoxy-4-ethylphenol; 4-Ethyl-2-methoxyphenol; 4-Ethylguaiacol; 4-Hydroxy-3-methoxy ethylbenzene; 4-Ethyl-2-methoxyphenol (4-ethylguaiacol); 4-Ethyl-2-metoxy phenol; Guaiacol, 4-ethyl; p-Ethyl-2-methoxyphenol; Phenol, 2-methoxy-4-ethyl; 4-ethyl guiacol; ethylguiacol (4-ethyl-2-methoxyphenol)

Phase change data

Data compiled by: Robert L. Brown and Stephen E. Stein
Reduced pressure boiling point
Tboil (K) | Pressure (bar) | Reference |
---|---|---|
368. to 369. | 0.007 | Frinton Laboratories Inc., 1986 |

References

Frinton Laboratories Inc., 1986
Frinton Laboratories Inc.,
Catalog Number 11, Frinton Laboratories Inc., Vineland, NJ, 1986, 99. [all data]