Phenol, 2-methoxy-4-propyl-
- Formula: C10H14O2
- Molecular weight: 166.2170
- IUPAC Standard InChIKey: PXIKRTCSSLJURC-UHFFFAOYSA-N
- CAS Registry Number: 2785-87-7
- Chemical structure:
View 3d structure (requires JavaScript / HTML 5) - Other names: (4-Hydroxy-3-methoxyphenyl)propane; p-Propylguaiacol; Cerulignol; Coerulignol; Dihydroeugenol; Guaiacylpropane; 1-(4-Hydroxy-3-methoxyphenyl)propane; 2-Methoxy-4-propylphenol; 4-Hydroxy-3-methoxypropylbenzene; 4-Propyl-2-methoxyphenol; 4-Propylguaiacol; 2-Methoxy-4-n-propylphenol; p-n-Propylguaiacol; 1-Propyl-3-methoxy-4-hydroxybenzene; 2-Methoxy-4-(1-propyl)phenol; Eugenol dihydro; Phenol, 4-propyl, 2-methoxy; 1-(3-Methoxy-4-hydroxyphenyl)propane; Guaiacol, 4-propyl-; NSC 53043; 4-Propyl-2-methoxyphenol (4-propylguaiacol); Propyl guaiacol; 2-Methoxy-4-propylphenol (p-propylguaiacol)

Phase change data

Data compiled as indicated in comments:
BS - Robert L. Brown and Stephen E. Stein
TRC - Thermodynamics Research Center, NIST Boulder Laboratories, Chris Muzny director
AC - William E. Acree, Jr., James S. Chickos
Quantity | Value | Units | Method | Reference | Comment |
---|---|---|---|---|---|
Tfus | 289.15 | K | N/A | Coulthard, Marshall, et al., 1930 | Uncertainty assigned by TRC = 2. K; TRC |
Reduced pressure boiling point
Tboil (K) | Pressure (bar) | Reference | Comment |
---|---|---|---|
401. to 403. | 0.020 | Frinton Laboratories Inc., 1986 | BS |
Enthalpy of vaporization
ΔvapH (kJ/mol) | Temperature (K) | Method | Reference | Comment |
---|---|---|---|---|
78.0 | 388. | A | Stephenson and Malanowski, 1987 | Based on data from 373. to 413. K.; AC |

Normal alkane RI, polar column, custom temperature program

Data compiled by: NIST Mass Spectrometry Data Center, William E. Wallace, director

Column type CapillaryCapillaryCapillaryCapillaryCapillary
Active phase DB-WaxSOLGel-WaxSOLGel-WaxDB-WaxSupelcowax-10
Column length (m) 60.30.30.30.30.
Carrier gas HeliumHeliumHeliumHydrogenHelium
Substrate
Column diameter (mm) 0.200.250.250.320.25
Phase thickness (μm) 0.250.250.250.500.25
Program 40 0C (3 min) 2 0C/min -> 150 0C 4 0C/min -> 220 0C (20 min) 5 0C/min -> 230 0C40 0C (2 min) 5 0C/min -> 140 0C 10 0C/min -> 250 0C (3 min)not specified40 0C (5 min) 4 0C/min -> 100 0C 6 0C/min -> 220 0C (20 min)45 0C 3 0C/min -> 230 0C (10 min) 10 0C/min -> 270 0C (21 min)
I 2103.2117.2103.2115.2083.
ReferenceGyawali and Kim, 2012Johanningsmeier and McFeeters, 2011Johanningsmeier and McFeeters, 2011San-Juan, Petka, et al., 2010de Simon, Estruelas, et al., 2009
Comment MSDC-RI MSDC-RI MSDC-RI MSDC-RI MSDC-RI
Column type CapillaryCapillary
Active phase SOLGel-WaxSOLGel-Wax
Column length (m) 30.30.
Carrier gas HeliumHelium
Substrate
Column diameter (mm) 0.530.53
Phase thickness (μm) 0.500.50
Program 40 0C 7 0C/min -> 180 0C 10 0C/min -> 240 0C (10 min)not specified
I 2091.2090.
ReferenceShu and Shen, 2008Shu and Shen, 2008
Comment MSDC-RI MSDC-RI

Van Den Dool and Kratz RI, non-polar column, custom temperature program

Data compiled by: NIST Mass Spectrometry Data Center, William E. Wallace, director

Column type CapillaryCapillaryCapillaryCapillaryCapillary
Active phase DB-5MSDB-5MSLM-5LM-5DB-5MS
Column length (m) 30.30.30.30.30.
Carrier gas HeHeHeHeH2/N2
Substrate
Column diameter (mm) 0.320.320.250.250.25
Phase thickness (μm) 0.50.50.250.250.25
Program 70C => 5C/min => 85C(1min) => 3C/min => 165C => 10C/min => 280C(3min)70C(1min) => 3C/min => 80C(1min) => 5C/min => 150C => 10C/min => 280C (4min)60C(2min) => 15C/min => 180C => 5C/min => 280C (10min)60C(2min) => 15C/min => 180C => 5C/min => 280C(5min)40C (5min) => 2C/min => 200C => 5C/min => 250C (15min)
I 1382.1382.1375.41376.31356.
ReferenceVarlet, Serot, et al., 2007Varlet V., Knockaert C., et al., 2006Ré-Poppi and Santiago-Silva, 2005Ré-Poppi and Santiago-Silva, 2002Boulanger and Crouzet, 2000
Comment MSDC-RI MSDC-RI MSDC-RI MSDC-RI MSDC-RI

References

Coulthard, Marshall, et al., 1930
Coulthard, C.E.; Marshall, J.; Pyman, F.L.,
The Variation of Phenol Coefficients in a Homologous Series of Phenols,
J. Chem. Soc., 1930, 1930, 280. [all data]
Frinton Laboratories Inc., 1986
Frinton Laboratories Inc.,
Catalog Number 11, Frinton Laboratories Inc., Vineland, NJ, 1986, 99. [all data]
Stephenson and Malanowski, 1987
Stephenson, Richard M.; Malanowski, Stanislaw,
Handbook of the Thermodynamics of Organic Compounds, 1987, https://doi.org/10.1007/978-94-009-3173-2
. [all data]