5,5'-Bitetrazole

Condensed phase thermochemistry data

Data compiled by: Hussein Y. Afeefy, Joel F. Liebman, and Stephen E. Stein

Quantity Value Units Method Reference Comment
Δfsolid531.70 ± 0.96kJ/molCcrBaroody and Carpenter, 1979
Δfsolid531.70kJ/molCcrBaroody and Carpenter, 1976see Baroody and Carpenter, 1972
Quantity Value Units Method Reference Comment
Δcsolid-1604.6 ± 0.96kJ/molCcrBaroody and Carpenter, 1979

References

Baroody and Carpenter, 1979
Baroody, E.E.; Carpenter, G.A., Enthalpies of formation of bitetrazole and bis(2,2,2-trinitroethyl)formal, J. Chem. Eng. Data, 1979, 24, 3-6. [all data]

Baroody and Carpenter, 1976
Baroody, E.E.; Carpenter, G.A., Heats of formation of propellant compounds (U), Rpt. NCWC/WOL-TR-76-77 by Naval Surface Weapons Center, Silver Spring, MD, 1976, 1-20. [all data]

Baroody and Carpenter, 1972
Baroody, E.E.; Carpenter, G.A., Heats of formation of propellant compounds (U), Rpt. Naval Ordnance Systems Command Task No. 331-003/067-1/UR2402-001 for Naval Ordance Station, Indian Head, MD, 1972, 1-9. [all data]