di-tert-butyl α,α,α',α'-tetramethyl-(p-phenylenedimethylene) diperoxide

Condensed phase thermochemistry data

Data compiled by: Hussein Y. Afeefy, Joel F. Liebman, and Stephen E. Stein

Quantity Value Units Method Reference Comment
Δfsolid-568.6 ± 6.4kJ/molCcbVan-Chin-Syan, Dolbneva, et al., 1984
Quantity Value Units Method Reference Comment
Δcsolid-12160.7 ± 6.4kJ/molCcbVan-Chin-Syan, Dolbneva, et al., 1984Corresponding Δfsolid = -568.6 kJ/mol (simple calculation by NIST; no Washburn corrections)

References

Van-Chin-Syan, Dolbneva, et al., 1984
Van-Chin-Syan, Yu.Ya.; Dolbneva, T.N.; Dikii, M.A.; Cuchmarev, S.K., Thermochemistry of derivatives of isopropylbenzene and p-diisopropylbenzene, Russ. J. Phys. Chem. (Engl. Transl.), 1984, 58, 1783-1785. [all data]