Bicyclo[3.2.0]heptane
- Formula: C7H12
- Molecular weight: 96.1702
- IUPAC Standard InChIKey: AWYMFBJJKFTCFO-UHFFFAOYSA-N
- CAS Registry Number: 278-07-9
- Chemical structure:
View 3d structure (requires JavaScript / HTML 5) - Stereoisomers:

Phase change data

Data compiled by: Thermodynamics Research Center, NIST Boulder Laboratories, Chris Muzny director
Quantity | Value | Units | Method | Reference | Comment |
---|---|---|---|---|---|
Tboil | 382.4 | K | N/A | Blomquist and Kwiatek, 1951 | Uncertainty assigned by TRC = 1.5 K |

Reaction thermochemistry data

Data compiled by: Hussein Y. Afeefy, Joel F. Liebman, and Stephen E. Stein
Individual Reactions
By formula: 2H2 + C7H8 = C7H12
Quantity | Value | Units | Method | Reference | Comment |
---|---|---|---|---|---|
ΔrH° | -381. ± 0.4 | kJ/mol | Chyd | Roth, Klaerner, et al., 1983 | liquid phase; solvent: Isooctane |
By formula: H2 + C7H10 = C7H12
Quantity | Value | Units | Method | Reference | Comment |
---|---|---|---|---|---|
ΔrH° | -233. ± 1. | kJ/mol | Chyd | Roth, Klaerner, et al., 1983 | liquid phase; solvent: Isooctane |
By formula: H2 + C7H10 = C7H12
Quantity | Value | Units | Method | Reference | Comment |
---|---|---|---|---|---|
ΔrH° | -268. ± 1. | kJ/mol | Chyd | Roth, Klaerner, et al., 1983 | liquid phase; solvent: Isooctane |
By formula: 2H2 + C7H8 = C7H12
Quantity | Value | Units | Method | Reference | Comment |
---|---|---|---|---|---|
ΔrH° | -262. ± 0.4 | kJ/mol | Chyd | Roth, Adamczak, et al., 1991 | liquid phase |
By formula: H2 + C7H10 = C7H12
Quantity | Value | Units | Method | Reference | Comment |
---|---|---|---|---|---|
ΔrH° | -165. ± 1. | kJ/mol | Chyd | Roth, Adamczak, et al., 1991 | liquid phase |
By formula: H2 + C7H10 = C7H12
Quantity | Value | Units | Method | Reference | Comment |
---|---|---|---|---|---|
ΔrH° | -116. ± 0.4 | kJ/mol | Chyd | Roth, Adamczak, et al., 1991 | liquid phase |

References

Blomquist and Kwiatek, 1951
Blomquist, A.T.; Kwiatek, J.,
The Addition of Ketene to Cyclic Conjugated Dienes,
J. Am. Chem. Soc., 1951, 73, 2098-2100. [all data]
Roth, Klaerner, et al., 1983
Roth, W.R.; Klaerner, F.G.; Gerit, F.; Grimme, W.; Koeser, H.G.; Busch, R.; Muskulus, B.; Breuckmann, R.; Scholz, B.P.; Lennartz, H.W.,
Stereochemistry of the bicyclo[2.1.0]pentane ring opening: thermolysis of tricyclo[3.2.0.0(,)]heptane derivatives,
Chem. Ber., 1983, 116, 2717-2737. [all data]
Roth, Adamczak, et al., 1991
Roth, W.R.; Adamczak, O.; Breuckmann, R.; Lennartz, H.-W.; Boese, R.,
Die Berechnung von Resonanzenergien; das MM2ERW-Kraftfeld,
Chem. Ber., 1991, 124, 2499-2521. [all data]