Propiophenone, 2,3-epoxy-3-(p-methoxyphenyl)-, trans-
- Formula: C16H14O3
- Molecular weight: 254.2806
- IUPAC Standard InChIKey: OJNVQVXKXBOSSW-HZPDHXFCSA-N
- CAS Registry Number: 27729-95-9
- Chemical structure:
View 3d structure (requires JavaScript / HTML 5) - Permanent link for this species. Use this link for bookmarking this species for future reference.

Condensed phase thermochemistry data

Data compiled by: Hussein Y. Afeefy, Joel F. Liebman, and Stephen E. Stein
Quantity | Value | Units | Method | Reference | Comment |
---|---|---|---|---|---|
ΔfH°solid | -297. | kJ/mol | Ccb | Moureu, 1930 | |
Quantity | Value | Units | Method | Reference | Comment |
ΔcH°solid | -8036.2 | kJ/mol | Ccb | Moureu, 1930 | Corresponding ΔfHºsolid = -261. kJ/mol (simple calculation by NIST; no Washburn corrections) |

References

Moureu, 1930
Moureu, M.H.,
Des sur la tautomerie des dicetones α,
Ann. Chem., 1930, 14, 283-405. [all data]