Bicyclo[2.2.1]heptane-2,3-dione, 1,7,7-trimethyl-, (1S)-

Phase change data

Data compiled by: William E. Acree, Jr., James S. Chickos

Enthalpy of fusion

ΔfusH (kJ/mol) Temperature (K) Reference Comment
6.07473.2Elsabee and Prankerd, 1992Fusion enthalpy seems low, compound may have an unmeasured phase transition at a lower temperature]

References

Elsabee and Prankerd, 1992
Elsabee, M.; Prankerd, R.J., Solid-state properties of drugs. III. Differential scanning calorimetry of chiral drug mixtures existing as racemic solid solutions, racemic mixtures or racemic compounds, International Journal of Pharmaceutics, 1992, 86, 2-3, 221-230, https://doi.org/10.1016/0378-5173(92)90200-L . [all data]