trans 2,2,4,6,6-pentamethyl-3-heptene
- Formula: C12H24
- Molecular weight: 168.3190
- IUPAC Standard InChIKey: NBUMCEJRJRRLCA-CSKARUKUSA-N
- CAS Registry Number: 27656-49-1
- Chemical structure:
View 3d structure (requires JavaScript / HTML 5) - Species with the same structure:
- Stereoisomers:

Phase change data

Data compiled by: William E. Acree, Jr., James S. Chickos
Quantity | Value | Units | Method | Reference | Comment |
---|---|---|---|---|---|
ΔvapH° | 65.9 ± 0.3 | kJ/mol | GS | Verevkin, Wandschneider, et al., 2000 | Based on data from 291. to 318. K. |
Enthalpy of vaporization
ΔvapH (kJ/mol) | Temperature (K) | Method | Reference | Comment |
---|---|---|---|---|
65.6 ± 0.5 | 305. | GS | Verevkin, Wandschneider, et al., 2000 | Based on data from 291. to 318. K. |

References

Verevkin, Wandschneider, et al., 2000
Verevkin, Sergey P.; Wandschneider, Dirk; Heintz, Andreas,
Determination of Vaporization Enthalpies of Selected Linear and Branched C 7 , C 8 , C 9 , C 11 , and C 12 Monoolefin Hydrocarbons from Transpiration and Correlation Gas-Chromatography Methods,
J. Chem. Eng. Data, 2000, 45, 4, 618-625, https://doi.org/10.1021/je990297k
. [all data]