1,5,9-Cyclododecatriene, (E,Z,Z)-
- Formula: C12H18
- Molecular weight: 162.2713
- IUPAC Standard InChIKey: ZOLLIQAKMYWTBR-UDIJVJLMSA-N
- CAS Registry Number: 2765-29-9
- Chemical structure:
View 3d structure (requires JavaScript / HTML 5) - Stereoisomers:
- Other names: cis,cis,trans-1,5,9-Cyclododecatriene; cis,trans,cis-1,5,9-Cyclododecatriene; trans,cis,cis-1,5,9-Cyclododecatriene; cis,trans,trans-1,5,9-Cyclododecatriene; trans,sic,cis-1,5,9-Cyclododecatriene; trans,cis,cis-cyclododeca-1,5,9-triene

Phase change data

Data compiled by: Robert L. Brown and Stephen E. Stein
Quantity | Value | Units | Method | Reference | Comment |
---|---|---|---|---|---|
Tboil | 504.2 | K | N/A | Aldrich Chemical Company Inc., 1990 |

Kovats' RI, non-polar column, isothermal

Column type | Active phase | Temperature (C) | I | Reference | Comment |
---|---|---|---|---|---|
Capillary | Methyl Silicone | 160. | 1335. | Boneva and Balbolov, 1993 | 50. m/0.25 mm/1.0 μm, N2 |
Capillary | Methyl Silicone | 170. | 1344. | Boneva and Balbolov, 1993 | 50. m/0.25 mm/1.0 μm, N2 |
Capillary | OV-101 | 100. | 1297. | Diez, Guillen, et al., 1990 | N2; Column length: 25. m; Column diameter: 0.23 mm |
Capillary | Squalane | 100. | 1283.2 | Diez, Guillen, et al., 1990 | N2; Column length: 45. m; Column diameter: 0.5 mm |
Capillary | Squalane | 80. | 1270.4 | Diez, Guillen, et al., 1990 | N2; Column length: 45. m; Column diameter: 0.5 mm |
Capillary | SE-54 | 100. | 1317.2 | Diez, Guillen, et al., 1990 | N2; Column length: 25. m; Column diameter: 0.22 mm |
Capillary | SE-54 | 80. | 1303.3 | Diez, Guillen, et al., 1990 | N2; Column length: 25. m; Column diameter: 0.22 mm |
Capillary | OV-101 | 100. | 1297. | Bermejo, Blanco, et al., 1987 | N2; Column length: 25. m; Column diameter: 0.23 mm |
Capillary | Squalane | 120. | 1298. | Schomburg, 1967 | Ar; Column length: 100. m |
Capillary | Squalane | 120. | 1294. | Schomburg, 1966 |

References

Aldrich Chemical Company Inc., 1990
Aldrich Chemical Company Inc.,
Catalog Handbook of Fine Chemicals, Aldrich Chemical Company, Inc., Milwaukee WI, 1990, 1. [all data]
Boneva and Balbolov, 1993
Boneva, S.; Balbolov, E.,
Capillary gas chromatography of hydrogenation products of 1,5,9-cyclododecatriene stereoisomers,
Chromatographia, 1993, 37, 5/6, 277-280, https://doi.org/10.1007/BF02278633
. [all data]
Diez, Guillen, et al., 1990
Diez, M.A.; Guillen, M.D.; Blanco, C.G.; Bermejo, J.,
Chromatographic study of methylcyclopentadiene dimers and iso-dimers and determination of their boiling points,
J. Chromatogr., 1990, 508, 363-374, https://doi.org/10.1016/S0021-9673(00)91279-2
. [all data]
Bermejo, Blanco, et al., 1987
Bermejo, J.; Blanco, C.G.; Diez, M.A.; Guillén, M.D.,
Kováts retention indices of selected mono and polycyclic olefins,
J. Hi. Res. Chromatogr. Chromatogr. Comm., 1987, 10, 8, 461-463, https://doi.org/10.1002/jhrc.1240100809
. [all data]
Schomburg, 1967
Schomburg, G.,
Struktur und Retentionsverhalten von Offenkettigen und Cyclischen Kohlenwasserstoffen und Deren Einfacher Substitutionsprodukte,
Anal. Chim. Acta., 1967, 38, 45-64, https://doi.org/10.1016/S0003-2670(01)80560-2
. [all data]
Schomburg, 1966
Schomburg, G.,
Gaschromatographische Retentionsdaten und struktur chemischer verbindungen. III. Alkylverzweigte und ungesättigte cyclische Kohlenwasserstoffe,
J. Chromatogr., 1966, 23, 18-41, https://doi.org/10.1016/S0021-9673(01)98653-4
. [all data]