Naphthalene, 1-propyl-
- Formula: C13H14
- Molecular weight: 170.2503
- IUPAC Standard InChIKey: HMAMGXMFMCAOPV-UHFFFAOYSA-N
- CAS Registry Number: 2765-18-6
- Chemical structure:
View 3d structure (requires JavaScript / HTML 5) - Other names: 1-n-Propylnaphthalene; 1-Propylnaphthalene

Condensed phase thermochemistry data

Data compiled by: Hussein Y. Afeefy, Joel F. Liebman, and Stephen E. Stein
Quantity | Value | Units | Method | Reference | Comment |
---|---|---|---|---|---|
ΔcH°liquid | -6820. | kJ/mol | Ccb | Hipsher and Wise, 1954 | ΔHfusion=4.2 kcal/mol; Corresponding ΔfHºliquid = -300. kJ/mol (simple calculation by NIST; no Washburn corrections) |

Phase change data

Data compiled by: Thermodynamics Research Center, NIST Boulder Laboratories, Chris Muzny director
Quantity | Value | Units | Method | Reference | Comment |
---|---|---|---|---|---|
Tboil | 546. ± 3. | K | AVG | N/A | Average of 9 values; Individual data points |
Quantity | Value | Units | Method | Reference | Comment |
Tfus | 264.55 | K | N/A | Hipsher and Wise, 1954, 2 | Uncertainty assigned by TRC = 0.2 K |
Tfus | 365. | K | N/A | Roblin, Davidson, et al., 1935 | Uncertainty assigned by TRC = 2. K |

Kovats' RI, non-polar column, isothermal

Column type | Active phase | Temperature (C) | I | Reference | Comment |
---|---|---|---|---|---|
Packed | OV-1 | 150. | 1462. | Antal, 1984 | Chromosorb W HP; Column length: 2.5 m |
Packed | OV-3 | 150. | 1504. | Antal, 1984 | Chromosorb W HP; Column length: 2.5 m |
Capillary | Apiezon L | 200. | 1445. | Klemm, Shabtai, et al., 1981 | |
Packed | OV-1 | 150. | 1463. | Bartik, Jánosi, et al., 1980 | Chromosorb W HP; Column length: 2.5 m |
Capillary | OV-1 | 130. | 1460. | Engewald, Wennrich, et al., 1979 | Column length: 50. m; Column diameter: 0.23 mm |

Lee's RI, non-polar column, temperature ramp

Column type | Active phase | I | Reference | Comment |
---|---|---|---|---|
Capillary | CP Sil 8 CB | 255.1 | Bundt, Herbel, et al., 1991 | 50. m/0.25 mm/0.25 μm, He, 4. K/min; Tstart: 80. C; Tend: 300. C |

References

Hipsher and Wise, 1954
Hipsher, H.F.; Wise, P.H.,
Dicyclic hydrocarbons. VIII. 1-Alkylnaphthalenes and some of their tetrahydro derivatives,
J. Am. Chem. Soc., 1954, 76, 1747-1748. [all data]
Hipsher and Wise, 1954, 2
Hipsher, H.F.; Wise, P.H.,
Dicyclic Hydrocarbons VIII. 1-Alkylnaphthalenes and Some of Their Tetrahydro Derivatives,
J. Am. Chem. Soc., 1954, 76, 1747-8. [all data]
Roblin, Davidson, et al., 1935
Roblin, R.O.; Davidson, D.; Bogert, M.T.,
J. Am. Chem. Soc., 1935, 57, 151. [all data]
Antal, 1984
Antal, J.,
Adatok az alkil-naftalinok gáz-folyadék kromatográfiájához, I.,
Magy. Kem. Foly., 1984, 90, 121-125. [all data]
Klemm, Shabtai, et al., 1981
Klemm, L.H.; Shabtai, J.; Bodily, K.C.,
Gas chromatography of some C13-C16 alkylnaphthalenes on Bentone 34, silicone fluid DC 550 and Apiezon L phases,
J. Chromatogr., 1981, 206, 2, 372-375, https://doi.org/10.1016/S0021-9673(00)82549-2
. [all data]
Bartik, Jánosi, et al., 1980
Bartik, T.; Jánosi, A.; Simon, Á.,
Qualitative and quantitative analysis of propylnaphthalenes by gas chromatography on silicone stationary phases,
J. Chromatogr., 1980, 197, 1, 92-96, https://doi.org/10.1016/S0021-9673(00)80540-3
. [all data]
Engewald, Wennrich, et al., 1979
Engewald, W.; Wennrich, L.; Ritter, E.,
Molekülstruktur und Retentionsverhalten. XII. Zur Retention von Alkylnaphthalinen Bei der Gasverteilungs- und Gas-Adsorptions-Chromatographie,
J. Chromatogr., 1979, 174, 2, 315-323, https://doi.org/10.1016/S0021-9673(00)86005-7
. [all data]
Bundt, Herbel, et al., 1991
Bundt, J.; Herbel, W.; Steinhart, H.; Franke, S.; Francke, W.,
Structure-type separation of diesel fuels by solid phase extraction and identification of the two- and three-ring aromatics by capillary GC-mass spectrometry,
J. Hi. Res. Chromatogr., 1991, 14, 2, 91-98, https://doi.org/10.1002/jhrc.1240140205
. [all data]