Pentanamide, N-butyl
- Formula: C9H19NO
- Molecular weight: 157.2533
- IUPAC Standard InChIKey: PKOPLDUHARSIKV-UHFFFAOYSA-N
- CAS Registry Number: 2763-67-9
- Chemical structure:
View 3d structure (requires JavaScript / HTML 5) - Other names: n-Butylpentanamide

Kovats' RI, non-polar column, isothermal

Column type | Active phase | Temperature (C) | I | Reference | Comment |
---|---|---|---|---|---|
Packed | SE-30 | 180. | 1338. | Krawczyk and Piotrowski, 1989 | N2, Chromosorb W AW; Column length: 1. m |

References

Krawczyk and Piotrowski, 1989
Krawczyk, W.; Piotrowski, G.T.,
Relationships Between Structure and Retention Index for N-Substituted Amides of Aliphatic Acids on a Non-Polar Column,
J. Chromatogr., 1989, 463, 297-304, https://doi.org/10.1016/S0021-9673(01)84484-8
. [all data]