4,4'-Biphenyldiisocyanate
- Formula: C14H8N2O2
- Molecular weight: 236.2255
- IUPAC Standard InChIKey: RQBUVIFBALZGPC-UHFFFAOYSA-N
- CAS Registry Number: 2761-22-0
- Chemical structure:
View 3d structure (requires JavaScript / HTML 5) - Permanent link for this species. Use this link for bookmarking this species for future reference.

Condensed phase thermochemistry data

Data compiled by: Hussein Y. Afeefy, Joel F. Liebman, and Stephen E. Stein
Quantity | Value | Units | Method | Reference | Comment |
---|---|---|---|---|---|
ΔfH°solid | -50.2 ± 4.2 | kJ/mol | Ccb | Selivanov and Konstantinov, 1975 | |
Quantity | Value | Units | Method | Reference | Comment |
ΔcH°solid | -6602.4 ± 4.2 | kJ/mol | Ccb | Selivanov and Konstantinov, 1975 |

References

Selivanov and Konstantinov, 1975
Selivanov, V.D.; Konstantinov, I.I.,
Thermochemistry of chloroaryl isocyanates,
Russ. J. Phys. Chem. (Engl. Transl.), 1975, 49, 620-621. [all data]