Cyclopropanecarboxanilide, 3',4'-dichloro-
- Formula: C10H9Cl2NO
- Molecular weight: 230.091
- IUPAC Standard InChIKey: PLQDLOBGKJCDSZ-UHFFFAOYSA-N
- CAS Registry Number: 2759-71-9
- Chemical structure:
View 3d structure (requires JavaScript / HTML 5) - Other names: Cypromid; Cyclopropanecarboxamide, N-(3,4-dichlorophenyl)-; Clobber; N-(3,4-Dichlorophenyl)cyclopropanecarboxamide; N-(3,4-Dichlorophenyl)cyclopropanecarboxyamide; 3',4'-Dichlorocyclopropanecarboxanilide; Cipromid; Cypromide; 3,4-Dichloranilid kyseliny cyklopropankarboxylove; S-6000

Phase change data

Data compiled by: Thermodynamics Research Center, NIST Boulder Laboratories, Chris Muzny director
Quantity | Value | Units | Method | Reference | Comment |
---|---|---|---|---|---|
Tfus | 403.4 | K | N/A | Plato, 1972 | Uncertainty assigned by TRC = 0.2 K |

References

Plato, 1972
Plato, C.,
DSC as a general method for determining purity and heat of fusion of high-purity organic chemicals,
Anal. Chem., 1972, 44, 1531. [all data]