4,9-Epoxy-1H-benz[f]isoindole-1,3-(2H)-dione, 3a,4,9,9a-tetrahydro-2,4,9-triphenyl-
- Formula: C30H21NO3
- Molecular weight: 443.4926
- IUPAC Standard InChIKey: KWMPZTMQZIIVKU-UHFFFAOYSA-N
- CAS Registry Number: 27594-00-9
- Chemical structure:
View 3d structure (requires JavaScript / HTML 5) - Permanent link for this species. Use this link for bookmarking this species for future reference.

Reaction thermochemistry data

Data compiled by: Hussein Y. Afeefy, Joel F. Liebman, and Stephen E. Stein
Individual Reactions
By formula: C20H14O + C10H7NO2 = C30H21NO3
Quantity | Value | Units | Method | Reference | Comment |
---|---|---|---|---|---|
ΔrH° | -98.32 ± 0.75 | kJ/mol | Cm | Kiselev, Ustyugov, et al., 1977 | liquid phase; solvent: Dioxane |

References

Kiselev, Ustyugov, et al., 1977
Kiselev, V.D.; Ustyugov, A.N.; Breus, I.P.; Konovalov, A.I.,
Kinetic and thermochemical study of the Diels-Alder reaction,
Dokl. Phys. Chem. (Engl. Transl.), 1977, 234, 320-322, In original 1089. [all data]