1-Benzylpiperazine
- Formula: C11H16N2
- Molecular weight: 176.2581
- IUPAC Standard InChIKey: IQXXEPZFOOTTBA-UHFFFAOYSA-N
- CAS Registry Number: 2759-28-6
- Chemical structure:
View 3d structure (requires JavaScript / HTML 5) - Other names: N-Benzylpiperazine; Piperazine, 1-(phenylmethyl)-; Benzylpiperazine; Piperazine, 1-benzyl-; 4-Benzylpiperazine; BZP; N-(Phenylmethyl)piperazine; NSC 40889

Van Den Dool and Kratz RI, non-polar column, custom temperature program

Column type | Active phase | I | Reference | Comment |
---|---|---|---|---|
Capillary | VF-5MS | 1516.1 | Tret'yakov, 2008 | 30. m/0.25 mm/0.25 μm, He; Program: Multi-step temperature program; T(initial)=60C; T(final)=270C |

References

Tret'yakov, 2008
Tret'yakov, K.V.,
Retention Data. NIST Mass Spectrometry Data Center., NIST Mass Spectrometry Data Center, 2008. [all data]