Undecane, 5-ethyl-5-propyl-
- Formula: C16H34
- Molecular weight: 226.4412
- IUPAC Standard InChIKey: MEBZNFSYULDMSV-UHFFFAOYSA-N
- CAS Registry Number: 2755-07-9
- Chemical structure:
View 3d structure (requires JavaScript / HTML 5) - Other names: Butyl(ethyl)(hexyl)(propyl)methane

Phase change data

Data compiled by: Thermodynamics Research Center, NIST Boulder Laboratories, Chris Muzny director
Quantity | Value | Units | Method | Reference | Comment |
---|---|---|---|---|---|
Tfus | 198. | K | N/A | Rabjohn, 1955 | Uncertainty assigned by TRC = 5. K |

References

Rabjohn, 1955
Rabjohn, N.,
Unpublished, Univ. of Missouri, Columbus, 1955. [all data]