occidenol
- Formula: C15H24O2
- Molecular weight: 236.3499
- IUPAC Standard InChIKey: MHBHVBZBPFDCSL-UHFFFAOYSA-N
- CAS Registry Number: 27548-56-7
- Chemical structure:
View 3d structure (requires JavaScript / HTML 5) - Permanent link for this species. Use this link for bookmarking this species for future reference.

Kovats' RI, non-polar column, temperature ramp

Column type | Active phase | I | Reference | Comment |
---|---|---|---|---|
Capillary | DB-5 | 1669. | Andersen, Gagnon, et al., 1995 | 2. K/min; Tstart: 40. C; Tend: 210. C |

Kovats' RI, polar column, temperature ramp

Column type | Active phase | I | Reference | Comment |
---|---|---|---|---|
Capillary | Supelcowax-10 | 2328. | Andersen, Gagnon, et al., 1995 | 2. K/min; Tstart: 40. C; Tend: 210. C |

Normal alkane RI, non-polar column, custom temperature program

Column type | Active phase | I | Reference | Comment |
---|---|---|---|---|
Capillary | DB-5 | 1674. | de Menezes, Lemos, et al., 2005 | 30. m/0.25 mm/0.25 μm, He; Program: 35C => 4C/min => 180C => 10C/min => 250C |

References

Andersen, Gagnon, et al., 1995
Andersen, A.; Gagnon, H.; Collin, G.; Adams, R.P.,
Essential oil of the wood of Thuja occidentalis L.,
J. Essent. Oil Res., 1995, 7, 5, 489-495, https://doi.org/10.1080/10412905.1995.9698572
. [all data]
de Menezes, Lemos, et al., 2005
de Menezes, J.E.S.A.; Lemos, T.L.G.; Silveira, E.R.; Andrade-Neto, M.; Nascimento, R.F.; Pessoa, O.D.L.,
Volatile constituents of Cordia trichotoma Vell. from the northeast of Brazil,
Flavour Fragr. J., 2005, 20, 2, 149-151, https://doi.org/10.1002/ffj.1394
. [all data]