(S)-α-methyl-2-naphthalenemethanol
- Formula: C12H12O
- Molecular weight: 172.2231
- IUPAC Standard InChIKey: AXRKCRWZRKETCK-SECBINFHSA-N
- CAS Registry Number: 27544-18-9
- Chemical structure:
View 3d structure (requires JavaScript / HTML 5) - Stereoisomers:

Phase change data

Data compiled by: Thermodynamics Research Center, NIST Boulder Laboratories, Chris Muzny director
Quantity | Value | Units | Method | Reference | Comment |
---|---|---|---|---|---|
Tfus | 337.65 | K | N/A | Zeiss and Tsutsui, 1953 | Uncertainty assigned by TRC = 2. K |

References

Zeiss and Tsutsui, 1953
Zeiss, H.H.; Tsutsui, M.,
The Carbon-Oxygen Absorption Band in the Infrared Spectra of Alcohols,
J. Am. Chem. Soc., 1953, 75, 897. [all data]