Cyclobutane, methylene-
- Formula: C5H6
- Molecular weight: 66.1011
- IUPAC Standard InChIKey: QIRVGKYPAOQVNP-UHFFFAOYSA-N
- CAS Registry Number: 27538-13-2
- Chemical structure:
View 3d structure (requires JavaScript / HTML 5) - Species with the same structure:

Reaction thermochemistry data

Data compiled by: Hussein Y. Afeefy, Joel F. Liebman, and Stephen E. Stein
Individual Reactions
By formula: C5H6 = C5H6
Quantity | Value | Units | Method | Reference | Comment |
---|---|---|---|---|---|
ΔrH° | -8. ± 3. | kJ/mol | Eqk | Roth, Hopf, et al., 1994 | gas phase; At 490 K |
ΔrH° | -3.6 | kJ/mol | Eqk | Pasto and Kong, 1989 | liquid phase |

References

Roth, Hopf, et al., 1994
Roth, W.R.; Hopf, H.; Horn, C.,
Propargyl-Stabilisierungsenergie,
Chem. Ber., 1994, 127, 1781-1795. [all data]
Pasto and Kong, 1989
Pasto, D.J.; Kong, W.,
Study of the substituted vinylallene-methylenecyclobutene electrocyclic equilibria. Comparison with the butadiene-cyclobutene and bisallene-bismethylenecyclobutene electrocyclic equilibria,
J. Org. Chem., 1989, 54, 4028-4033. [all data]