trans-1,2-bis(2-naphthyl)ethylene
- Formula: C22H16
- Molecular weight: 280.3624
- IUPAC Standard InChIKey: JOYUAZDDXKUTIY-MDZDMXLPSA-N
- CAS Registry Number: 2753-11-9
- Chemical structure:
View 3d structure (requires JavaScript / HTML 5) - Species with the same structure:
- Stereoisomers:

Phase change data

Data compiled by: Thermodynamics Research Center, NIST Boulder Laboratories, Chris Muzny director
Quantity | Value | Units | Method | Reference | Comment |
---|---|---|---|---|---|
Tfus | 522. | K | N/A | Sangster and Irvine, 1956 | Uncertainty assigned by TRC = 4. K |

References

Sangster and Irvine, 1956
Sangster, R.C.; Irvine, J.W.,
Study of Organic Scintillators,
J. Chem. Phys., 1956, 24, 670. [all data]