propane-1,2,3-triyl tris[(Z)-docos-13-enoate]
- Formula: C69H128O6
- Molecular weight: 1053.7510
- CAS Registry Number: 2752-99-0

Condensed phase thermochemistry data

Data compiled by: Hussein Y. Afeefy, Joel F. Liebman, and Stephen E. Stein
Quantity | Value | Units | Method | Reference | Comment |
---|---|---|---|---|---|
ΔcH°solid | -10230.00 ± 0.31 | kcal/mol | Ccb | Freedman, Bagby, et al., 1989 | Corresponding ΔfHºsolid = -631.69 kcal/mol (simple calculation by NIST; no Washburn corrections) |

References

Freedman, Bagby, et al., 1989
Freedman, B.; Bagby, M.O.; Khoury, H.,
Correlation of heats of combustion with empirical formulas for fatty alcohols,
J. Am. Oil Chem. Soc., 1989, 66, 595-596. [all data]