2,5-di(4-biphenylyl)oxazole
- Formula: C27H19NO
- Molecular weight: 373.4459
- IUPAC Standard InChIKey: DDZJGFHXUOWOSL-UHFFFAOYSA-N
- CAS Registry Number: 27479-62-5
- Chemical structure:
View 3d structure (requires JavaScript / HTML 5) - Species with the same structure:

Phase change data

Data compiled by: Thermodynamics Research Center, NIST Boulder Laboratories, Chris Muzny director
Quantity | Value | Units | Method | Reference | Comment |
---|---|---|---|---|---|
Tfus | 513.5 | K | N/A | Sangster and Irvine, 1956 | Uncertainty assigned by TRC = 3. K |

References

Sangster and Irvine, 1956
Sangster, R.C.; Irvine, J.W.,
Study of Organic Scintillators,
J. Chem. Phys., 1956, 24, 670. [all data]