(1α,2α,3β,6β)-1,2,3,6-tetrahydro-3,6-methanophthalic anhydride
- Formula: C9H8O3
- Molecular weight: 164.1580
- IUPAC Standard InChIKey: KNDQHSIWLOJIGP-GBNDHIKLSA-N
- CAS Registry Number: 2746-19-2
- Chemical structure:
View 3d structure (requires JavaScript / HTML 5) - Stereoisomers:
- Other names: exo-5-norbornene-2,3-dicarboxylic anhydride

Phase change data

Data compiled by: William E. Acree, Jr., James S. Chickos
Enthalpy of fusion
ΔfusH (kJ/mol) | Temperature (K) | Method | Reference |
---|---|---|---|
21.77 | 416.2 | DSC | Pincock, Wilson, et al., 1967 |

References

Pincock, Wilson, et al., 1967
Pincock, Richard E.; Wilson, Keith R.; Kiovsky, Thomas E.,
Thermal isomerization in polycrystalline exo- and endo-5-norbornene-2,3-dicarboxylic anhydrides,
J. Am. Chem. Soc., 1967, 89, 26, 6890-6897, https://doi.org/10.1021/ja01002a015
. [all data]