Perhydrophenanthrene, (4aα, 4bβ, 8aβ, 10aα)-
- Formula: C14H24
- Molecular weight: 192.3404
- IUPAC Standard InChIKey: GNMCGMFNBARSIY-AAVRWANBSA-N
- CAS Registry Number: 27389-74-8
- Chemical structure:
View 3d structure (requires JavaScript / HTML 5) - Stereoisomers:
- Perhydrophenanthrene, (4aα, 4bβ, 8aα, 10aβ)-
- cis,syn,cis-Perhydrophenanthrene
- Perhydrophenanthrene, (4aα, 4bβ, 8aα, 10a.alpha)-
- Perhydrophenanthrene, (4aα, 4bα, 8aβ, 10a.beta)-
- Perhydrophenanthrene, (4aα, 4bα, 8aα, 10aβ)-
- Phenanthrene, tetradecahydro-
- Tricyclo[8.4.0.0(2,7)]dodecane, isomer # 1
- Tricyclo[8.4.0.0(2,7)]dodecane, isomer # 2
- Tricyclo[8.4.0.0(2,7)]dodecane, isomer # 3
- Tricyclo[8.4.0.0(2,7)]dodecane, isomer # 4

Reaction thermochemistry data

Data compiled by: Hussein Y. Afeefy, Joel F. Liebman, and Stephen E. Stein
Individual Reactions
By formula: C14H20 = C14H24
Quantity | Value | Units | Method | Reference | Comment |
---|---|---|---|---|---|
ΔrH° | 36.3 | kJ/mol | Eqk | Honig and Allinger, 1985 | liquid phase; solvent: Acetic acid; Heat of isomerization GC |

References

Honig and Allinger, 1985
Honig, H.; Allinger, N.L.,
The stereoisomers of perhydrophenanthrene,
J. Org. Chem., 1985, 50, 4630-4632. [all data]