Perhydrophenanthrene, (4aα, 4bβ, 8aα, 10a.alpha)-
- Formula: C14H24
- Molecular weight: 192.3404
- IUPAC Standard InChIKey: GNMCGMFNBARSIY-XJFOESAGSA-N
- CAS Registry Number: 27389-73-7
- Chemical structure:
View 3d structure (requires JavaScript / HTML 5) - Stereoisomers:
- Perhydrophenanthrene, (4aα, 4bβ, 8aα, 10aβ)-
- cis,syn,cis-Perhydrophenanthrene
- Perhydrophenanthrene, (4aα, 4bβ, 8aβ, 10aα)-
- Perhydrophenanthrene, (4aα, 4bα, 8aβ, 10a.beta)-
- Perhydrophenanthrene, (4aα, 4bα, 8aα, 10aβ)-
- Phenanthrene, tetradecahydro-
- Tricyclo[8.4.0.0(2,7)]dodecane, isomer # 1
- Tricyclo[8.4.0.0(2,7)]dodecane, isomer # 2
- Tricyclo[8.4.0.0(2,7)]dodecane, isomer # 3
- Tricyclo[8.4.0.0(2,7)]dodecane, isomer # 4
- Other names: Tetradecahydrophenanthrene-, cis-anti-trans-; 4aα,4bβ,8aα,10aα-Tetradecahydrophenanthrene; 4a alpha, 4b beta, 8a alpha, 10a alpha-Tetradecahydrophenanthrene

Gas phase thermochemistry data

Data compiled by: Glushko Thermocenter, Russian Academy of Sciences, Moscow
Constant pressure heat capacity of gas
Cp,gas (J/mol*K) | Temperature (K) | Reference | Comment |
---|---|---|---|
48.86 | 50. | Dorofeeva O.V., 1988 | Recommended values were calculated statistically mechanically using force field approximation for polycyclic aromatic hydrocarbons to estimate the needed vibrational frequencies (see also [ Dorofeeva O.V., 1986]). These functions are reproduced in the reference book [ Frenkel M., 1994]. |
79.49 | 100. | ||
113.42 | 150. | ||
149.03 | 200. | ||
209.26 | 273.15 | ||
231.8 ± 3.5 | 298.15 | ||
233.51 | 300. | ||
325.61 | 400. | ||
409.55 | 500. | ||
480.68 | 600. | ||
540.15 | 700. | ||
590.07 | 800. | ||
632.25 | 900. | ||
668.06 | 1000. | ||
698.57 | 1100. | ||
724.65 | 1200. | ||
747.01 | 1300. | ||
766.26 | 1400. | ||
782.88 | 1500. |

Phase change data

Data compiled as indicated in comments:
TRC - Thermodynamics Research Center, NIST Boulder Laboratories, Chris Muzny director
AC - William E. Acree, Jr., James S. Chickos
Quantity | Value | Units | Method | Reference | Comment |
---|---|---|---|---|---|
Tfus | 313. | K | N/A | Nuzzi, 1982 | Uncertainty assigned by TRC = 1. K; TRC |
Enthalpy of fusion
ΔfusH (kJ/mol) | Temperature (K) | Reference | Comment |
---|---|---|---|
11.16 | 313. | Domalski and Hearing, 1996 | AC |

Reaction thermochemistry data

Data compiled by: Hussein Y. Afeefy, Joel F. Liebman, and Stephen E. Stein
Individual Reactions
By formula: C14H20 = C14H24
Quantity | Value | Units | Method | Reference | Comment |
---|---|---|---|---|---|
ΔrH° | 29.8 | kJ/mol | Eqk | Honig and Allinger, 1985 | liquid phase; solvent: Acetic acid; Heat of isomerization GC |

References

Dorofeeva O.V., 1988
Dorofeeva O.V.,
Thermodynamic Properties of Polycyclic Aromatic Hydrocarbons in the Gaseous Phase. Institute for High Temperatures, USSR Academy of Sciences, Preprint No.1-238 (in Russian), Moscow, 1988. [all data]
Dorofeeva O.V., 1986
Dorofeeva O.V.,
On calculation of thermodynamic properties of polycyclic aromatic hydrocarbons,
Thermochim. Acta, 1986, 102, 59-66. [all data]
Frenkel M., 1994
Frenkel M.,
Thermodynamics of Organic Compounds in the Gas State, Vol. I, II, Thermodynamics Research Center, College Station, Texas, 1994, 1994. [all data]
Nuzzi, 1982
Nuzzi, M.,
Thermal data and thermodynamic functions of perhydrophenanthrenes,
Riv. Combust., 1982, 36, 41. [all data]
Domalski and Hearing, 1996
Domalski, Eugene S.; Hearing, Elizabeth D.,
Heat Capacities and Entropies of Organic Compounds in the Condensed Phase. Volume III,
J. Phys. Chem. Ref. Data, 1996, 25, 1, 1, https://doi.org/10.1063/1.555985
. [all data]
Honig and Allinger, 1985
Honig, H.; Allinger, N.L.,
The stereoisomers of perhydrophenanthrene,
J. Org. Chem., 1985, 50, 4630-4632. [all data]