2-Ethylbutyryl chloride
- Formula: C6H11ClO
- Molecular weight: 134.604
- IUPAC Standard InChIKey: SMUKODJVMQOSAB-UHFFFAOYSA-N
- CAS Registry Number: 2736-40-5
- Chemical structure:
View 3d structure (requires JavaScript / HTML 5) - Other names: Butanoyl chloride, 2-ethyl-; Butyryl chloride, 2-ethyl-; 2-Ethylbutyroyl chloride; 2-Ethylbutiryl chloride; Diethylacetyl chloride

Phase change data

Data compiled as indicated in comments:
TRC - Thermodynamics Research Center, NIST Boulder Laboratories, Chris Muzny director
AC - William E. Acree, Jr., James S. Chickos
Quantity | Value | Units | Method | Reference | Comment |
---|---|---|---|---|---|
Tboil | 413. | K | N/A | Miller, Dessert, et al., 1970 | Uncertainty assigned by TRC = 6. K; TRC |
Tboil | 413. | K | N/A | Miller, Dessert, et al., 1948 | Uncertainty assigned by TRC = 6. K; TRC |
Enthalpy of vaporization
ΔvapH (kJ/mol) | Temperature (K) | Method | Reference | Comment |
---|---|---|---|---|
39.4 | 328. | A | Stephenson and Malanowski, 1987 | Based on data from 313. to 412. K.; AC |

Van Den Dool and Kratz RI, non-polar column, custom temperature program

Column type | Active phase | I | Reference | Comment |
---|---|---|---|---|
Capillary | VF-5MS | 850.6 | Tret'yakov, 2007 | 30. m/0.25 mm/0.25 μm, He; Program: Multi-step temperature program; T(initial)=60C; T(final)=270C |

References

Miller, Dessert, et al., 1970
Miller, W.H.; Dessert, A.M.; Anderson, G.W.,
The Synthesis of Some 6-Substituted-2-thiouracils,
J. Am. Chem. Soc., 1970, 70, 500-3. [all data]
Miller, Dessert, et al., 1948
Miller, W.H.; Dessert, A.M.; Anderson, G.W.,
The Synthesis of Some 6-Substituted-2-thiouracils,
J. Am. Chem. Soc., 1948, 70, 500-3. [all data]
Stephenson and Malanowski, 1987
Stephenson, Richard M.; Malanowski, Stanislaw,
Handbook of the Thermodynamics of Organic Compounds, 1987, https://doi.org/10.1007/978-94-009-3173-2
. [all data]
Tret'yakov, 2007
Tret'yakov, K.V.,
Retention Data. NIST Mass Spectrometry Data Center., NIST Mass Spectrometry Data Center, 2007. [all data]