Isobutyryl bromide
- Formula: C4H7BrO
- Molecular weight: 151.002
- IUPAC Standard InChIKey: ICNCZFQYZKPYMS-UHFFFAOYSA-N
- CAS Registry Number: 2736-37-0
- Chemical structure:
View 3d structure (requires JavaScript / HTML 5) - Other names: Propanoyl bromide, 2-methyl-

Phase change data

Data compiled as indicated in comments:
TRC - Thermodynamics Research Center, NIST Boulder Laboratories, Chris Muzny director
AC - William E. Acree, Jr., James S. Chickos
Quantity | Value | Units | Method | Reference | Comment |
---|---|---|---|---|---|
Tboil | 388. | K | N/A | Yamase, 1961 | Uncertainty assigned by TRC = 3. K; TRC |
Enthalpy of vaporization
ΔvapH (kJ/mol) | Temperature (K) | Method | Reference | Comment |
---|---|---|---|---|
45.7 | 301. | A | Stephenson and Malanowski, 1987 | Based on data from 286. to 436. K. See also Stull, 1947.; AC |

References

Yamase, 1961
Yamase, Y.,
Friedel-Crafts Acylation II. Relative Reactivity for Some Acyl Halides,
Bull. Chem. Soc. Jpn., 1961, 34, 480-84. [all data]
Stephenson and Malanowski, 1987
Stephenson, Richard M.; Malanowski, Stanislaw,
Handbook of the Thermodynamics of Organic Compounds, 1987, https://doi.org/10.1007/978-94-009-3173-2
. [all data]
Stull, 1947
Stull, Daniel R.,
Vapor Pressure of Pure Substances. Organic and Inorganic Compounds,
Ind. Eng. Chem., 1947, 39, 4, 517-540, https://doi.org/10.1021/ie50448a022
. [all data]