Benzoxazole

Gas phase thermochemistry data

Data compiled by: Hussein Y. Afeefy, Joel F. Liebman, and Stephen E. Stein

Quantity Value Units Method Reference Comment
Δfgas45.14 ± 0.52kJ/molCcbSteele, Chirico, et al., 1992DSC

Condensed phase thermochemistry data

Data compiled as indicated in comments:
ALS - Hussein Y. Afeefy, Joel F. Liebman, and Stephen E. Stein
DH - Eugene S. Domalski and Elizabeth D. Hearing

Quantity Value Units Method Reference Comment
Δfsolid-24.2 ± 1.1kJ/molCcbSteele, Chirico, et al., 1992DSC; ALS
Quantity Value Units Method Reference Comment
Δcsolid-3445.0 ± 1.0kJ/molCcbSteele, Chirico, et al., 1992DSC; ALS
Quantity Value Units Method Reference Comment
solid,1 bar148.95J/mol*KN/ASteele, Chirico, et al., 1992, 2crystaline, I phase; S(liq,298.15 K) = 203.91 J/mol*K. S value for the liquid at 298.15 K was calculated with graphically extrapolated data.; DH

Constant pressure heat capacity of solid

Cp,solid (J/mol*K) Temperature (K) Reference Comment
141.59298.15Steele, Chirico, et al., 1992, 2crystaline, I phase; T = 5 to 650 K. Cp(liq,298.15 K) = 178.50 J/mol*K. Cp value for the liquid at 298.15 K was calculated with graphically extrapolated data.; DH

Gas phase ion energetics data

Data evaluated by: Edward P. Hunter and Sharon G. Lias

Quantity Value Units Method Reference Comment
Proton affinity (review)891.6kJ/molN/AHunter and Lias, 1998
Quantity Value Units Method Reference Comment
Gas basicity859.8kJ/molN/AHunter and Lias, 1998

Phase change data

Data compiled as indicated in comments:
BS - Robert L. Brown and Stephen E. Stein
TRC - Thermodynamics Research Center, NIST Boulder Laboratories, Chris Muzny director
AC - William E. Acree, Jr., James S. Chickos
DH - Eugene S. Domalski and Elizabeth D. Hearing

Quantity Value Units Method Reference Comment
Tboil455.7KN/AWeast and Grasselli, 1989BS
Tboil456.KN/AAmerican Tokyo Kasei, 1988BS
Tboil456.KN/ABuckingham and Donaghy, 1982BS
Quantity Value Units Method Reference Comment
Tfus304.KN/ABuckingham and Donaghy, 1982BS
Quantity Value Units Method Reference Comment
Ttriple302.500KN/ASteele, Chirico, et al., 1992, 2Crystal phase 1 phase; Uncertainty assigned by TRC = 0.003 K; TRC
Quantity Value Units Method Reference Comment
Δsub16.6 ± 0.1kcal/molCSabbah and Hevia, 1998AC

Enthalpy of vaporization

ΔvapH (kcal/mol) Temperature (K) Method Reference Comment
12.2320.EBSteele, Chirico, et al., 1992, 2AC
11.6360.EBSteele, Chirico, et al., 1992, 2AC
11.0400.EBSteele, Chirico, et al., 1992, 2AC
10.4440.EBSteele, Chirico, et al., 1992, 2AC
9.73480.EBSteele, Chirico, et al., 1992, 2AC

Enthalpy of fusion

ΔfusH (kcal/mol) Temperature (K) Reference Comment
4.011302.5Domalski and Hearing, 1996AC

Enthalpy of phase transition

ΔHtrs (kcal/mol) Temperature (K) Initial Phase Final Phase Reference Comment
0.004372247.0crystaline, IIcrystaline, ISteele, Chirico, et al., 1992, 2DH
4.0115302.505crystaline, IliquidSteele, Chirico, et al., 1992, 2DH

In addition to the Thermodynamics Research Center (TRC) data available from this site, much more physical and chemical property data is available from the following TRC products:

Normal alkane RI, non-polar column, temperature ramp

View large format table.

Column type Active phase I Reference Comment
CapillaryDB-11067.Chen and Ho, 199960. m/0.32 mm/1. μm, He, 2. K/min; Tstart: 40. C; Tend: 260. C
CapillaryDB-11067.Chen and Ho, 199860. m/0.32 mm/1.0 μm, He, 2. K/min; Tstart: 40. C; Tend: 260. C

Normal alkane RI, polar column, temperature ramp

View large format table.

Column type Active phase I Reference Comment
CapillaryCarbowax 20M1733.Liardon and Ledermann, 1980H2, 2. K/min; Column length: 39. m; Column diameter: 0.30 mm; Tstart: 60. C; Tend: 220. C

References

Steele, Chirico, et al., 1992
Steele, W.V.; Chirico, R.D.; Knipmeyer, S.E.; Nguyen, A., The thermodynamic properties of benzothiazole and benzoxazole, J. Chem. Thermodyn., 1992, 24, 449-529. [all data]

Steele, Chirico, et al., 1992, 2
Steele, W.V.; Chirico, R.D.; Knipmeyer, S.E.; Nguyen, A., The thermodynamic properties of benzothiazole and benzoxazole, J. Chem. Thermodynam., 1992, 24, 499-529. [all data]